<?xml version="1.0" standalone="no"?>
<!DOCTYPE svg PUBLIC "-//W3C//DTD SVG 1.1//EN"
"http://www.w3.org/Graphics/SVG/1.1/DTD/svg11.dtd">
<!-- Creator: fig2dev Version 3.2 Patchlevel 5e -->
<!-- CreationDate: Tue May 16 14:33:38 2017 -->
<!-- Magnification: 1.050 -->
<svg	xmlns="http://www.w3.org/2000/svg"
	xmlns:xlink="http://www.w3.org/1999/xlink"
	width="4.5in" height="2.6in"
	viewBox="1167 524 5422 3160">
<g style="stroke-width:.025in; fill:none">
<!-- Line -->
<polyline points="1986,3403
2246,2310
" style="stroke:#000000;stroke-width:8;
stroke-linejoin:miter; stroke-linecap:butt;
"/>
<!-- Text -->
<text xml:space="preserve" x="1680" y="3589" fill="#000000"  font-family="Times" font-style="normal" font-weight="normal" font-size="215" text-anchor="start">array iterators</text>
<!-- Line -->
<polyline points="4164,2370
4700,2653
" style="stroke:#000000;stroke-width:8;
stroke-linejoin:miter; stroke-linecap:butt;
"/>
<!-- Text -->
<text xml:space="preserve" x="4760" y="2786" fill="#000000"  font-family="Times" font-style="normal" font-weight="normal" font-size="215" text-anchor="start">homomorphic</text>
<!-- Text -->
<text xml:space="preserve" x="4760" y="3143" fill="#000000"  font-family="Times" font-style="normal" font-weight="normal" font-size="215" text-anchor="start">extension</text>
<!-- Line -->
<polyline points="4298,1225
3525,1842
" style="stroke:#000000;stroke-width:8;
stroke-linejoin:miter; stroke-linecap:butt;
"/>
<!-- Text -->
<text xml:space="preserve" x="4343" y="1194" fill="#000000"  font-family="Times" font-style="normal" font-weight="normal" font-size="215" text-anchor="start">arrays</text>
<!-- Line -->
<polyline points="2134,919
2164,1411
" style="stroke:#000000;stroke-width:8;
stroke-linejoin:miter; stroke-linecap:butt;
"/>
<!-- Text -->
<text xml:space="preserve" x="1205" y="793" fill="#000000"  font-family="Times" font-style="normal" font-weight="normal" font-size="215" text-anchor="start">struct, enums, packages, genericity, ...</text>
<!-- Ellipse -->
<ellipse transform="translate(2539,2074) rotate(-270.00063138)" rx="500" ry="699"
 style="stroke:#00008f;stroke-width:8;"/>
<!-- Text -->
<text xml:space="preserve" x="1991" y="2190" fill="#00008f"  font-family="Times" font-style="normal" font-weight="normal" font-size="215" text-anchor="start">lic</text>
<!-- Ellipse -->
<ellipse transform="translate(2582,2100) rotate(-0.00000000)" rx="1341" ry="1041"
 style="stroke:#8f0000;stroke-width:8;"/>
<!-- Text -->
<text xml:space="preserve" x="1502" y="2569" fill="#8f0000"  font-family="Times" font-style="normal" font-weight="normal" font-size="215" text-anchor="start">V6</text>
<!-- Ellipse -->
<ellipse transform="translate(3412,2071) rotate(-0.00000000)" rx="1060" ry="609"
 style="stroke:#008f00;stroke-width:8;"/>
<!-- Circle -->
<circle cx="2766" cy="2335" r="154"
 style="stroke:#0000b0;stroke-width:8;"/>
<!-- Text -->
<text xml:space="preserve" x="3976" y="2202" fill="#008f00"  font-family="Times" font-style="normal" font-weight="normal" font-size="215" text-anchor="start">V4</text>
<!-- Text -->
<text xml:space="preserve" x="2647" y="2422" fill="#00008f"  font-family="Times" font-style="normal" font-weight="normal" font-size="215" text-anchor="start">ec</text>
<!-- Circle -->
<circle cx="2807" cy="2078" r="428"
 style="stroke:#000000;stroke-width:8;"/>
<!-- Text -->
<text xml:space="preserve" x="2494" y="1986" fill="#000000"  font-family="Times" font-style="normal" font-weight="normal" font-size="215" text-anchor="start">lustre</text>
<!-- Text -->
<text xml:space="preserve" x="2583" y="2160" fill="#000000"  font-family="Times" font-style="normal" font-weight="normal" font-size="215" text-anchor="start">core</text>
<!-- Line: box -->
<rect x="1168" y="525" width="5420" height="3152" rx="0" 
style="stroke:#000000;stroke-width:0;
stroke-linejoin:miter; stroke-linecap:butt;
"/>
</g>
</svg>
