#FIG 3.2
Landscape
Center
Metric
A4      
100.00
Single
-2
1200 2
1 3 0 1 8 7 50 0 -1 0.000 1 0.0000 4185 3420 270 270 4185 3420 4455 3420
1 3 0 1 8 7 50 0 -1 0.000 1 0.0000 6885 3420 270 270 6885 3420 7155 3420
2 2 0 0 0 7 50 0 -1 0.000 0 0 -1 0 0 5
	 135 2160 12150 2160 12150 4725 135 4725 135 2160
3 2 0 1 8 7 50 0 -1 0.000 0 0 1 3
	1 1 3.00 90.00 150.00
	 4185 3690 5490 4230 6795 3690
	 0.000 -1.000 0.000
3 2 1 1 8 7 50 0 -1 4.000 0 1 0 3
	1 1 3.00 90.00 150.00
	 3240 4500 3825 4230 4050 3690
	 0.000 -1.000 0.000
3 2 0 1 8 7 50 0 -1 0.000 0 1 0 3
	1 1 3.00 90.00 150.00
	 4185 3150 5490 2655 6795 3150
	 0.000 -1.000 0.000
3 2 0 1 8 7 50 0 -1 0.000 0 1 0 4
	1 1 3.00 90.00 150.00
	 7155 3330 7785 2970 7785 3825 7155 3555
	 0.000 -1.000 -1.000 0.000
3 2 0 1 8 7 50 0 -1 0.000 0 1 0 4
	1 1 3.00 90.00 150.00
	 3915 3330 3285 2970 3285 3825 3915 3555
	 0.000 -1.000 -1.000 0.000
4 0 0 50 0 0 18 0.0000 4 195 135 4095 3510 1\001
4 0 8 50 0 0 18 0.0000 4 195 540 4590 3150 1000\001
4 0 8 50 0 0 18 0.0000 4 195 135 7245 3060 1\001
4 0 8 50 0 0 18 0.0000 4 195 540 5940 3870 1000\001
4 0 8 50 0 0 18 0.0000 4 195 135 3735 3060 1\001
4 0 8 50 0 0 18 0.0000 4 195 135 6795 3510 2\001
4 0 -1 50 0 0 18 0.0000 6 270 3510 180 3510 $up\\_and\\_down(\\var, 0, 10, 4)$\001
4 0 -1 50 0 0 18 0.0000 6 270 3765 4320 4635 $switch \\wedge (\\var = pre \\ \\var)$\001
4 0 -1 50 0 0 18 0.0000 6 270 3510 7965 3510 $up\\_and\\_down(\\var, 0, 10, 1)$\001
4 0 -1 50 0 0 18 0.0000 6 270 3765 4320 2430 $switch \\wedge (\\var = pre \\ \\var)$\001
