#FIG 3.2
Landscape
Center
Metric
A4      
100.00
Single
-2
1200 2
1 3 0 1 0 7 50 0 -1 0.000 1 0.0000 2565 3150 225 225 2565 3150 2700 3330
1 3 0 1 0 7 50 0 -1 0.000 1 0.0000 6744 3150 225 225 6744 3150 6879 3330
1 3 0 1 0 7 50 0 -1 0.000 1 0.0000 1171 3154 225 225 1171 3154 1306 3334
1 3 0 1 0 7 50 0 -1 0.000 1 0.0000 3966 3150 225 225 3966 3150 4101 3330
1 3 0 1 0 7 50 0 -1 0.000 1 0.0000 5344 3150 225 225 5344 3150 5479 3330
2 1 0 1 0 7 50 0 -1 0.000 0 0 -1 1 0 2
	0 0 1.00 60.00 120.00
	 2790 3150 3735 3150
2 1 0 1 0 7 50 0 -1 0.000 0 0 -1 1 0 2
	0 0 1.00 60.00 120.00
	 4185 3150 5130 3150
2 1 0 1 0 7 50 0 -1 0.000 0 0 -1 1 0 2
	0 0 1.00 60.00 120.00
	 5580 3150 6525 3150
2 1 0 1 0 7 50 0 -1 0.000 0 0 -1 1 0 2
	0 0 1.00 60.00 120.00
	 1395 3150 2340 3150
2 1 0 1 0 7 50 0 -1 0.000 0 0 -1 1 0 2
	0 0 1.00 60.00 120.00
	 810 3645 1035 3375
3 0 0 1 0 7 50 0 -1 0.000 0 1 0 5
	0 0 1.00 60.00 120.00
	 2520 2925 2025 2745 2565 1665 3060 2745 2565 2925
	 0.000 1.000 1.000 1.000 0.000
3 0 0 1 0 7 50 0 -1 0.000 0 1 0 5
	0 0 1.00 60.00 120.00
	 3960 2925 3465 2745 4005 1665 4500 2745 4005 2925
	 0.000 1.000 1.000 1.000 0.000
3 0 0 1 0 7 50 0 -1 0.000 0 1 0 5
	0 0 1.00 60.00 120.00
	 5328 2925 4833 2745 5373 1665 5868 2745 5373 2925
	 0.000 1.000 1.000 1.000 0.000
3 0 0 1 0 7 50 0 -1 0.000 0 1 0 5
	0 0 1.00 60.00 120.00
	 6710 2925 6215 2745 6755 1665 7250 2745 6755 2925
	 0.000 1.000 1.000 1.000 0.000
4 0 0 50 0 0 12 0.0000 4 135 240 1710 3060 init\001
4 0 0 50 0 0 12 0.0000 4 135 90 1125 3195 1\001
4 0 0 50 0 0 12 0.0000 4 135 90 2520 3195 2\001
4 0 0 50 0 0 12 0.0000 4 135 90 3915 3195 3\001
4 0 0 50 0 0 12 0.0000 4 135 90 5310 3240 4\001
4 0 0 50 0 0 12 0.0000 4 135 90 6705 3240 5\001
4 0 0 50 0 0 12 0.0000 6 135 270 3060 3420 ok2\001
4 0 0 50 0 0 12 0.0000 6 135 315 4410 3420  ok1\001
4 0 0 50 0 0 12 0.0000 6 135 270 5850 3375 ok0\001
4 0 0 50 0 0 12 0.0000 6 150 570 2970 2970 pre cpt \001
4 0 0 50 0 0 12 0.0000 6 150 570 4410 2970 pre cpt \001
4 0 0 50 0 0 12 0.0000 6 150 570 5760 2970 pre cpt \001
4 0 0 50 0 0 12 0.0000 4 135 450 2340 1935 10000\001
4 0 0 50 0 0 12 0.0000 4 135 450 3780 1935 10000\001
4 0 0 50 0 0 12 0.0000 4 135 450 5130 1935 10000\001
4 0 0 50 0 0 12 0.0000 6 135 270 5220 2295 ok1\001
4 0 0 50 0 0 12 0.0000 6 135 315 6570 2295  ok0\001
4 0 0 50 0 0 12 0.0000 6 135 270 3870 2340 ok2\001
4 0 0 50 0 0 12 0.0000 6 135 270 2430 2295 ok3\001
