#FIG 3.2
Landscape
Center
Inches
Letter  
100.00
Single
-2
1200 2
2 5 0 1 0 -1 40 -1 20 0.000 0 0 -1 0 0 5
	0 detective.gif
	 3823 2247 4077 2247 4077 2528 3823 2528 3823 2247
2 1 0 2 0 7 40 -1 -1 0.000 0 0 -1 1 0 2
	1 1 2.10 68.08 122.54
	 3975 3220 3975 2607
2 2 0 0 0 7 0 -1 -1 0.000 0 0 -1 0 0 5
	 630 810 5940 810 5940 4590 630 4590 630 810
4 0 0 40 -1 6 6 0.0000 4 90 465 4040 3056 problem\001
