#FIG 3.2  Produced by xfig version 3.2.5-alpha5
Landscape
Center
Inches
A4      
100.00
Single
-2
1200 2
2 4 0 1 -1 7 50 0 -1 0.000 0 0 5 0 0 5
	 4159 1536 4159 1244 3683 1244 3683 1536 4159 1536
2 4 0 1 -1 7 50 0 -1 0.000 0 0 5 0 0 5
	 3821 1933 3821 1648 3318 1648 3318 1933 3821 1933
2 4 0 1 -1 7 50 0 -1 0.000 0 0 5 0 0 5
	 2792 1933 2792 1233 1769 1233 1769 1933 2792 1933
2 4 0 1 -1 7 50 0 -1 0.000 0 0 6 0 0 5
	 2252 1637 2252 1309 1874 1309 1874 1637 2252 1637
2 4 0 1 0 7 50 0 -1 0.000 0 0 7 0 0 5
	 4050 2400 4050 2100 2100 2100 2100 2400 4050 2400
2 2 0 1 7 7 0 0 -1 0.000 0 0 -1 0 0 5
	 900 825 5175 825 5175 2475 900 2475 900 825
2 4 0 1 -1 7 50 0 -1 0.000 0 0 5 0 0 5
	 4397 2021 4397 975 1650 975 1650 2021 4397 2021
2 4 0 1 -1 7 50 0 -1 0.000 0 0 6 0 0 5
	 2688 1843 2688 1560 2352 1560 2352 1843 2688 1843
2 4 0 3 20 -1 60 0 -1 0.000 0 0 6 0 0 5
	 2688 1840 2352 1840 2352 1557 2688 1557 2688 1840
2 4 0 3 20 7 60 0 -1 0.000 0 0 5 0 0 5
	 4163 1535 3687 1535 3687 1243 4163 1243 4163 1535
2 4 0 3 20 7 60 0 -1 0.000 0 0 7 0 0 5
	 4057 2400 2107 2400 2107 2100 4057 2100 4057 2400
3 2 0 1 -1 7 50 0 -1 0.000 0 1 0 3
	1 1 1.00 53.34 106.68
	 4390 1580 5063 2015 4074 2280
	 0.000 -1.000 0.000
3 2 0 1 -1 7 50 0 -1 0.000 0 1 0 3
	1 1 1.00 53.34 106.68
	 2064 2305 1061 2047 1629 1548
	 0.000 -1.000 0.000
3 2 0 1 -1 7 50 0 -1 0.000 0 1 1 3
	1 1 1.00 53.34 106.68
	1 1 1.00 53.34 106.68
	 2771 1410 3324 1202 3662 1366
	 0.000 -1.000 0.000
3 2 0 1 -1 7 50 0 -1 0.000 0 1 1 3
	1 1 1.00 53.34 106.68
	1 1 1.00 53.34 106.68
	 2792 1782 3073 1914 3283 1863
	 0.000 -1.000 0.000
3 2 0 1 -1 7 50 0 -1 0.000 0 1 1 3
	1 1 1.00 53.34 106.68
	1 1 1.00 53.34 106.68
	 3851 1858 4005 1800 4061 1543
	 0.000 -1.000 0.000
3 2 0 1 -1 7 50 0 -1 0.000 0 1 1 3
	1 1 1.00 53.34 106.68
	1 1 1.00 53.34 106.68
	 1993 1649 2091 1782 2351 1775
	 0.000 -1.000 0.000
4 1 0 50 0 0 12 0.0000 6 165 990 3000 1125 application\001
4 1 0 50 0 0 9 0.0000 6 105 780 2963 2286 environment\001
4 1 19 60 0 0 12 0.0000 6 135 90 2519 1761 ?\001
4 1 19 60 0 0 12 0.0000 6 135 90 3934 1461 ?\001
4 1 19 60 0 0 12 0.0000 6 135 90 3674 2271 ?\001
