#FIG 3.2
Landscape
Center
Inches
Letter  
100.00
Single
-2
1200 2
2 1 0 2 0 7 110 -1 -1 0.000 0 0 -1 1 0 4
	1 1 2.10 68.08 122.54
	 4815 3510 4815 4275 2954 4282 2954 3914
2 2 0 0 0 7 0 -1 -1 0.000 0 0 -1 0 0 5
	 630 810 5940 810 5940 4590 630 4590 630 810
4 0 0 110 -1 6 6 0.0000 4 90 1155 3322 4445 refinement (scenario)\001
4 0 0 110 -1 6 6 0.0000 4 75 135 4858 3839 ko\001
