#FIG 3.2
Portrait
Center
Metric
A4      
100.00
Single
-2
1200 2
6 5040 1935 5805 2430
4 0 0 50 0 -1 16 0.0000 4 165 675 5040 2115 lus2c / \001
4 0 0 50 0 -1 16 0.0000 4 165 750 5040 2430 scade2c\001
-6
6 2655 2070 4680 3330
6 2970 2340 4320 2970
4 0 12 50 0 12 16 0.0000 4 180 1350 2970 2520 sut.lus /\001
4 0 12 50 0 12 16 0.0000 4 150 1350 2970 2970 sut.saofd\001
-6
2 2 0 2 12 7 50 0 -1 0.000 0 0 -1 0 0 5
	 2700 2115 4635 2115 4635 3285 2700 3285 2700 2115
-6
2 2 0 2 0 7 50 0 -1 0.000 0 0 -1 0 0 5
	 9810 2385 10755 2385 10755 2880 9810 2880 9810 2385
2 2 0 2 0 7 50 0 -1 0.000 0 0 -1 0 0 5
	 9360 4410 11295 4410 11295 4905 9360 4905 9360 4410
2 2 0 2 0 7 50 0 -1 0.000 0 0 -1 0 0 5
	 6480 2430 7740 2430 7740 2925 6480 2925 6480 2430
2 2 0 2 0 7 50 0 -1 0.000 0 0 -1 0 0 5
	 6165 4455 8145 4455 8145 4950 6165 4950 6165 4455
2 1 0 2 0 7 50 0 -1 0.000 0 0 -1 1 0 2
	1 1 4.00 150.00 270.00
	 4635 2655 6480 2655
2 1 0 2 0 7 50 0 -1 0.000 0 0 -1 1 0 2
	1 1 4.00 150.00 270.00
	 7155 2925 7155 4455
2 1 0 2 0 7 50 0 -1 0.000 0 0 -1 1 0 2
	1 1 4.00 150.00 270.00
	 7740 2655 9810 2655
2 1 0 2 0 7 50 0 -1 0.000 0 0 -1 1 0 2
	1 1 4.00 150.00 270.00
	 8145 4680 9360 4680
4 0 9 50 0 -1 16 0.0000 4 225 1590 5355 3780 gen_stubs_scade\001
4 0 0 50 0 -1 16 0.0000 4 105 210 8415 2475 cc\001
4 0 0 50 0 -1 16 0.0000 4 105 210 8415 4500 cc\001
4 0 0 50 0 12 16 0.0000 4 135 750 9900 2700 sut.o\001
4 0 0 50 0 12 16 0.0000 4 180 1650 9495 4725 sut_stubs.o\001
4 0 0 50 0 12 16 0.0000 4 180 1650 6300 4770 sut_stubs.c\001
4 0 0 50 0 12 16 0.0000 4 135 750 6705 2745 sut.c\001
4 0 9 50 0 -1 16 0.0000 4 225 1695 5355 3420 gen_stubs_lustre /\001
