#FIG 3.2
Landscape
Center
Metric
A4      
100.00
Single
-2
1200 2
6 2295 3555 3735 4275
2 2 0 2 10 7 50 0 -1 4.000 0 0 -1 0 0 5
	 2340 3600 3690 3600 3690 4230 2340 4230 2340 3600
4 1 0 50 0 0 12 0.0000 6 135 975 3015 3870 Gestionnaire\001
4 1 0 50 0 0 12 0.0000 6 135 525 3015 4095 de test\001
-6
6 2250 2610 3780 3105
2 2 0 2 10 7 50 0 -1 6.000 0 0 -1 0 0 5
	 2295 2655 3735 2655 3735 3060 2295 3060 2295 2655
4 1 0 50 0 0 12 0.0000 6 135 1140 3015 2880 Environnement\001
-6
6 2475 4770 3555 5355
2 2 0 2 10 7 50 0 -1 6.000 0 0 -1 0 0 5
	 2520 4815 3510 4815 3510 5310 2520 5310 2520 4815
4 1 0 50 0 0 12 0.0000 6 135 510 3015 5130 Oracle\001
-6
6 2430 3060 3015 3600
2 1 0 1 0 7 50 0 -1 0.000 0 0 -1 1 0 2
	3 1 1.00 60.00 120.00
	 2970 3600 2970 3060
4 2 0 50 0 0 12 0.0000 6 180 420 2880 3420 step i\001
-6
6 2925 4230 4185 4815
2 1 0 1 0 7 50 0 -1 0.000 0 0 -1 1 0 2
	3 1 1.00 60.00 120.00
	 2970 4230 2970 4815
4 0 0 50 0 0 12 0.0000 6 195 1065 3105 4680 step $I_i,O_i$\001
-6
6 4365 3600 5445 4275
2 2 0 2 10 7 50 0 -1 6.000 0 0 -1 0 0 5
	 4410 3645 5400 3645 5400 4230 4410 4230 4410 3645
4 1 0 50 0 0 12 0.0000 6 180 765 4905 3870 Syst\\`eme\001
4 1 0 50 0 0 12 0.0000 6 105 705 4905 4095 sous test\001
-6
2 1 0 1 0 7 50 0 -1 0.000 0 0 -1 1 0 2
	3 1 1.00 60.00 120.00
	 3690 3915 4410 3915
4 1 0 50 0 0 12 0.0000 6 195 750 4050 3825 step $I_i$\001
