#FIG 3.2  Produced by xfig version 3.2.5b
Landscape
Center
Metric
A4      
100.00
Single
-2
1200 2
6 3240 4005 4320 5316
6 3240 4005 4320 5316
2 2 0 1 0 7 40 -1 20 0.000 0 0 -1 0 0 5
	 3394 4159 4320 4159 4320 5316 3394 5316 3394 4159
2 1 0 1 0 7 40 -1 -1 0.000 0 0 -1 0 0 2
	 3394 4313 4320 4313
2 2 0 1 0 7 41 -1 20 0.000 0 0 -1 0 0 5
	 3317 4082 4243 4082 4243 5239 3317 5239 3317 4082
2 1 0 1 0 7 41 -1 -1 0.000 0 0 -1 0 0 2
	 3317 4236 4243 4236
2 1 0 1 0 7 43 -1 20 0.000 0 0 -1 0 0 2
	 3240 4159 4166 4159
2 2 0 1 0 7 44 -1 20 0.000 0 0 -1 0 0 5
	 3240 4005 4166 4005 4166 5162 3240 5162 3240 4005
-6
-6
6 5940 4005 7020 5316
6 5940 4005 7020 5316
2 2 0 1 0 7 40 -1 20 0.000 0 0 -1 0 0 5
	 6094 4159 7020 4159 7020 5316 6094 5316 6094 4159
2 1 0 1 0 7 40 -1 -1 0.000 0 0 -1 0 0 2
	 6094 4313 7020 4313
2 2 0 1 0 7 41 -1 20 0.000 0 0 -1 0 0 5
	 6017 4082 6943 4082 6943 5239 6017 5239 6017 4082
2 1 0 1 0 7 41 -1 -1 0.000 0 0 -1 0 0 2
	 6017 4236 6943 4236
2 1 0 1 0 7 43 -1 20 0.000 0 0 -1 0 0 2
	 5940 4159 6866 4159
2 2 0 1 0 7 44 -1 20 0.000 0 0 -1 0 0 5
	 5940 4005 6866 4005 6866 5162 5940 5162 5940 4005
-6
-6
6 8820 4005 9900 5316
6 8820 4005 9900 5316
2 2 0 1 0 7 40 -1 20 0.000 0 0 -1 0 0 5
	 8974 4159 9900 4159 9900 5316 8974 5316 8974 4159
2 1 0 1 0 7 40 -1 -1 0.000 0 0 -1 0 0 2
	 8974 4313 9900 4313
2 2 0 1 0 7 41 -1 20 0.000 0 0 -1 0 0 5
	 8897 4082 9823 4082 9823 5239 8897 5239 8897 4082
2 1 0 1 0 7 41 -1 -1 0.000 0 0 -1 0 0 2
	 8897 4236 9823 4236
2 1 0 1 0 7 43 -1 20 0.000 0 0 -1 0 0 2
	 8820 4159 9746 4159
2 2 0 1 0 7 44 -1 20 0.000 0 0 -1 0 0 5
	 8820 4005 9746 4005 9746 5162 8820 5162 8820 4005
-6
-6
6 8820 5895 9900 7245
2 2 0 1 0 7 41 -1 20 0.000 0 0 -1 0 0 5
	 8820 5895 9900 5895 9900 7245 8820 7245 8820 5895
2 1 0 1 0 7 40 -1 -1 0.000 0 0 -1 0 0 2
	 8820 6075 9900 6075
-6
6 7582 3866 8077 4316
2 2 0 1 0 26 30 -1 20 0.000 0 0 -1 0 0 5
	 7582 3866 8077 3866 8077 4316 7582 4316 7582 3866
4 0 0 29 -1 18 12 0.0000 4 150 405 7627 4181 PRE\001
-6
6 10575 5940 11655 7290
2 2 0 1 0 7 41 -1 20 0.000 0 0 -1 0 0 5
	 10575 5940 11655 5940 11655 7290 10575 7290 10575 5940
2 1 0 1 0 7 40 -1 -1 0.000 0 0 -1 0 0 2
	 10575 6120 11655 6120
-6
2 1 0 1 0 7 50 -1 -1 0.000 0 0 -1 1 0 2
	1 1 3.10 75.00 135.00
	 1485 4725 2925 4725
2 1 0 1 0 7 50 -1 -1 0.000 0 0 -1 1 0 3
	1 1 3.10 75.00 135.00
	 7965 4725 7965 6660 8820 6660
2 1 0 1 0 7 49 -1 -1 0.000 0 0 -1 1 0 2
	1 1 3.10 75.00 135.00
	 7020 4725 8505 4725
2 4 0 2 0 31 50 -1 20 0.000 0 0 7 0 0 5
	 2250 5130 810 5130 810 4365 2250 4365 2250 5130
2 1 0 1 0 7 40 -1 -1 0.000 0 0 -1 1 0 4
	1 1 3.10 75.00 135.00
	 7965 6075 5445 6075 5445 6525 6030 6525
2 4 0 2 0 31 50 -1 20 0.000 0 0 7 0 0 5
	 4455 5625 2925 5625 2925 3690 4455 3690 4455 5625
2 4 0 2 0 31 50 -1 20 0.000 0 0 7 0 0 5
	 7155 5625 5625 5625 5625 3690 7155 3690 7155 5625
2 4 0 2 0 31 50 -1 20 0.000 0 0 7 0 0 5
	 10035 5625 8505 5625 8505 3690 10035 3690 10035 5625
2 1 0 1 0 7 49 -1 -1 0.000 0 0 -1 1 0 2
	1 1 3.10 75.00 135.00
	 4320 4725 5625 4725
2 1 0 1 0 7 40 -1 -1 0.000 0 0 -1 1 0 4
	1 1 2.10 45.00 75.00
	 2925 4725 3060 4725 3060 4545 3240 4545
2 1 0 1 0 7 40 -1 -1 0.000 0 0 -1 1 0 2
	1 1 2.10 45.00 75.00
	 3060 4725 3330 4725
2 1 0 1 0 7 40 -1 -1 0.000 0 0 -1 1 0 4
	1 1 2.10 45.00 75.00
	 2925 4725 3060 4725 3060 4905 3403 4904
2 1 0 1 0 7 40 -1 -1 0.000 0 0 -1 1 0 4
	1 1 2.10 45.00 75.00
	 5625 4725 5760 4725 5760 4545 5940 4545
2 1 0 1 0 7 40 -1 -1 0.000 0 0 -1 1 0 4
	1 1 2.10 45.00 75.00
	 8505 4725 8640 4725 8640 4545 8820 4545
2 1 0 1 0 7 40 -1 -1 0.000 0 0 -1 1 0 2
	1 1 2.10 45.00 75.00
	 8640 4725 8910 4725
2 1 0 1 0 7 40 -1 -1 0.000 0 0 -1 1 0 4
	1 1 2.10 45.00 75.00
	 8505 4725 8640 4725 8640 4905 8982 4904
2 1 0 1 0 7 40 -1 -1 0.000 0 0 -1 1 0 2
	1 1 2.10 45.00 75.00
	 5760 4725 6030 4725
2 1 0 1 0 7 40 -1 -1 0.000 0 0 -1 1 0 4
	1 1 2.10 45.00 75.00
	 5625 4725 5760 4725 5760 4905 6102 4905
2 1 0 1 0 7 40 -1 -1 0.000 0 0 -1 1 0 6
	1 1 3.10 75.00 135.00
	 10035 4725 10215 4725 10215 5760 8370 5760 8370 6345 8820 6345
2 1 0 1 0 7 40 -1 -1 0.000 0 0 -1 1 0 5
	1 1 3.10 75.00 135.00
	 7830 4725 7830 2790 315 2790 315 4680 810 4680
2 1 0 1 0 7 40 -1 -1 0.000 0 0 -1 1 0 2
	1 1 3.10 75.00 135.00
	 7830 4635 7830 4320
2 4 0 2 0 31 40 -1 20 0.000 0 0 7 0 0 5
	 7560 6885 6030 6885 6030 6300 7560 6300 7560 6885
2 1 0 1 0 7 40 -1 -1 0.000 0 0 -1 0 1 4
	1 1 3.10 75.00 135.00
	 6030 6750 5445 6750 5445 7065 8820 7065
2 4 0 2 0 31 50 -1 20 0.000 0 0 7 0 0 5
	 11610 5130 10530 5130 10530 4365 11610 4365 11610 5130
2 1 0 1 0 7 50 -1 -1 0.000 0 0 -1 1 0 2
	1 1 3.10 75.00 135.00
	 10080 4725 10530 4725
2 1 0 1 0 7 49 -1 -1 0.000 0 0 7 1 0 2
	1 1 3.10 75.00 135.00
	 11070 5130 11070 5895
2 2 0 1 0 11 60 -1 20 0.000 0 0 -1 0 0 5
	 11970 7605 90 7605 90 2520 11970 2520 11970 7605
4 0 0 40 -1 18 10 0.0000 4 120 705 1125 4770 LUCIOLE \001
4 0 0 40 -1 12 10 0.0000 4 90 270 3645 4275 ENV\001
4 0 0 40 -1 12 10 0.0000 4 90 270 6345 4275 SUT\001
4 0 0 40 -1 12 10 0.0000 4 105 630 9135 4275 oracle \001
4 0 0 40 -1 12 10 0.0000 4 105 360 9135 6030 .rif\001
4 0 0 40 -1 18 10 0.0000 4 120 720 6390 6525 sim2chro \001
4 0 0 40 -1 18 10 0.0000 4 150 795 6345 6750 gnuplot-rif\001
4 0 0 40 -1 18 10 0.0000 4 120 660 10665 4815 check-rif\001
4 0 0 40 -1 12 10 0.0000 4 75 360 10800 6075 .cov\001
