#FIG 3.2
Landscape
Center
Inches
Letter  
100.00
Single
-2
1200 2
2 1 0 2 0 7 50 -1 -1 0.000 0 0 -1 1 0 3
	1 1 2.10 68.08 122.54
	 3771 2362 2015 2362 2015 2648
2 1 0 2 0 7 50 -1 -1 0.000 0 0 -1 1 0 2
	1 1 2.10 68.08 122.54
	 2586 2362 2586 2648
2 2 0 0 0 7 0 -1 -1 0.000 0 0 -1 0 0 5
	 630 810 5940 810 5940 4590 630 4590 630 810
4 0 0 50 -1 6 6 0.0000 4 105 210 2760 2271 bug\001
