#FIG 3.2
Landscape
Center
Metric
A4      
100.00
Single
-2
1200 2
6 1203 868 1945 1525
1 3 0 1 0 7 50 0 -1 0.000 1 0.0000 1574 969 101 101 1574 969 1619 1059
1 3 0 1 0 7 50 0 -1 0.000 1 0.0000 1844 1419 101 101 1844 1419 1889 1509
1 3 0 1 0 7 50 0 -1 0.000 1 0.0000 1304 1424 101 101 1304 1424 1349 1514
2 1 0 1 0 7 50 0 -1 0.000 0 0 -1 1 0 2
	1 1 1.00 60.00 120.00
	 1499 1049 1314 1314
2 1 0 1 0 7 50 0 -1 0.000 0 0 -1 1 0 2
	1 1 1.00 60.00 120.00
	 1659 1049 1819 1314
-6
1 3 0 1 0 7 50 0 -1 0.000 1 0.0000 620 950 101 101 620 950 665 1040
1 3 0 1 0 7 50 0 -1 0.000 1 0.0000 890 1400 101 101 890 1400 935 1490
1 3 0 1 0 7 50 0 -1 0.000 1 0.0000 350 1405 101 101 350 1405 395 1495
1 3 0 1 0 7 50 0 -1 0.000 1 0.0000 3520 969 101 101 3520 969 3565 1059
1 3 0 1 0 7 50 0 -1 0.000 1 0.0000 2895 1419 101 101 2895 1419 2940 1509
1 3 0 1 0 7 50 0 -1 0.000 1 0.0000 3540 1429 101 101 3540 1429 3585 1519
1 3 0 1 0 7 50 0 -1 0.000 1 0.0000 4140 1419 101 101 4140 1419 4185 1509
1 3 0 1 0 7 50 0 -1 0.000 1 0.0000 6032 538 101 101 6032 538 6077 628
1 3 0 1 0 7 50 0 -1 0.000 1 0.0000 5521 765 65 65 5521 765 5586 765
1 3 0 1 0 7 50 0 -1 0.000 1 0.0000 5746 1010 65 65 5746 1010 5811 1010
1 3 0 1 0 7 50 0 -1 0.000 1 0.0000 5266 1020 65 65 5266 1020 5331 1020
1 3 0 1 0 7 50 0 -1 0.000 1 0.0000 6491 755 65 65 6491 755 6556 755
1 3 0 1 0 7 50 0 -1 0.000 1 0.0000 6256 1015 65 65 6256 1015 6321 1015
1 3 0 1 0 7 50 0 -1 0.000 1 0.0000 6771 1005 65 65 6771 1005 6836 1005
1 3 0 1 0 7 50 0 -1 0.000 1 0.0000 4976 1505 101 101 4976 1505 5021 1595
1 3 0 1 0 7 50 0 -1 0.000 1 0.0000 5481 1500 101 101 5481 1500 5526 1590
1 3 0 1 0 7 50 0 -1 0.000 1 0.0000 5846 1500 101 101 5846 1500 5891 1590
1 3 0 1 0 7 50 0 -1 0.000 1 0.0000 6216 1500 101 101 6216 1500 6261 1590
1 3 0 1 0 7 50 0 -1 0.000 1 0.0000 6606 1505 101 101 6606 1505 6651 1595
1 3 0 1 0 7 50 0 -1 0.000 1 0.0000 6971 1500 101 101 6971 1500 7016 1590
2 1 0 1 0 7 50 0 -1 0.000 0 0 -1 1 0 2
	1 1 1.00 60.00 120.00
	 545 1030 360 1295
2 1 0 1 0 7 50 0 -1 0.000 0 0 -1 1 0 2
	1 1 1.00 60.00 120.00
	 705 1030 865 1295
2 1 0 1 0 7 50 0 -1 0.000 0 0 -1 1 0 2
	1 1 1.00 60.00 120.00
	 3515 1074 3515 1319
2 1 0 1 0 7 50 0 -1 0.000 0 0 -1 1 0 3
	1 1 1.00 60.00 120.00
	 3425 1019 3020 1045 2915 1314
2 1 0 1 0 7 50 0 -1 0.000 0 0 -1 1 0 3
	1 1 1.00 60.00 120.00
	 3625 999 4040 1035 4115 1309
2 1 1 2 0 7 50 0 -1 6.000 0 0 -1 0 0 2
	 1080 635 1080 1680
2 1 0 1 0 7 50 0 -1 4.000 0 0 -1 1 0 2
	1 1 1.00 60.00 120.00
	 5936 550 5561 715
2 1 0 1 0 7 50 0 -1 4.000 0 0 -1 1 0 2
	1 1 1.00 60.00 120.00
	 6141 545 6441 700
2 1 0 1 0 7 50 0 -1 4.000 0 0 -1 1 0 2
	1 1 1.00 60.00 120.00
	 5466 810 5276 945
2 1 0 1 0 7 50 0 -1 4.000 0 0 -1 1 0 2
	1 1 1.00 60.00 120.00
	 5281 1095 5441 1410
2 1 0 1 0 7 50 0 -1 4.000 0 0 -1 1 0 2
	1 1 1.00 60.00 120.00
	 5586 810 5716 935
2 1 0 1 0 7 50 0 -1 4.000 0 0 -1 1 0 2
	1 1 1.00 60.00 120.00
	 6461 815 6281 960
2 1 0 1 0 7 50 0 -1 4.000 0 0 -1 1 0 2
	1 1 1.00 60.00 120.00
	 6556 795 6741 940
2 1 0 1 0 7 50 0 -1 4.000 0 0 -1 1 0 2
	1 1 1.00 60.00 120.00
	 5226 1075 4981 1400
2 1 0 1 0 7 50 0 -1 4.000 0 0 -1 1 0 2
	1 1 1.00 60.00 120.00
	 5761 1085 5826 1395
2 1 0 1 0 7 50 0 -1 4.000 0 0 -1 1 0 2
	1 1 1.00 60.00 120.00
	 6236 1090 6196 1405
2 1 0 1 0 7 50 0 -1 4.000 0 0 -1 1 0 2
	1 1 1.00 60.00 120.00
	 6756 1070 6591 1385
2 1 0 1 0 7 50 0 -1 4.000 0 0 -1 1 0 2
	1 1 1.00 60.00 120.00
	 6811 1070 6981 1400
4 0 -1 50 0 0 8 0.0000 6 105 120 1750 1105 \\Y\001
4 0 -1 50 0 0 8 0.0000 6 105 120 205 1105 \\A\001
4 0 -1 50 0 0 8 0.0000 6 105 105 800 1105 \\B\001
4 0 -1 50 0 0 8 0.0000 6 105 120 1170 1110 \\X\001
4 0 -1 50 0 0 8 0.0000 6 105 210 2845 984 \\AY\001
4 0 -1 50 0 0 8 0.0000 6 105 195 3745 974 \\BX\001
4 0 -1 50 0 0 8 0.0000 6 105 195 3125 1234 \\BY\001
4 0 0 50 0 0 8 0.0000 6 105 105 5121 870 \\B\001
4 0 0 50 0 0 8 0.0000 6 105 120 5741 870 \\A\001
4 0 0 50 0 0 8 0.0000 6 105 105 6521 1190 \\B\001
4 0 0 50 0 0 8 0.0000 6 105 120 6931 1195 \\A\001
4 0 0 50 0 0 8 0.0000 6 105 120 5816 1195 \\Y\001
4 0 0 50 0 0 8 0.0000 6 105 120 4886 1185 \\X\001
4 0 0 50 0 0 8 0.0000 6 105 120 5386 1195 \\Y\001
4 0 0 50 0 0 8 0.0000 6 105 120 6746 850 \\Y\001
4 0 0 50 0 0 8 0.0000 6 105 105 6261 1205 \\B\001
4 0 0 50 0 0 8 0.0000 6 105 120 6126 870 \\X\001
