{
    "workers": [
      {
        "methods" : [
            { "method" : "root_1" },
            { "method" : "root_2" }
        ]
      },
      {
        "methods" : [
            { "method" : "N0_task" },
            { "method" : "N1_task" }
        ]
      },
      {
        "methods" : [
            { "method": "N3_task" },
            { "method": "N2_task" },
            { "method": "N4_task" }
        ]
      }
    ]
 }
