digraph ring1000 {
graph [min_deg=2
	mean_deg=2.
	max_deg=2
	is_connected=true
	is_cyclic=true
	is_tree=false
	links_number=1000]
  p0 [algo="root.ml"]
  p1 [algo="p.ml"]
  p2 [algo="p.ml"]
  p3 [algo="p.ml"]
  p4 [algo="p.ml"]
  p5 [algo="p.ml"]
  p6 [algo="p.ml"]
  p7 [algo="p.ml"]
  p8 [algo="p.ml"]
  p9 [algo="p.ml"]
  p10 [algo="p.ml"]
  p11 [algo="p.ml"]
  p12 [algo="p.ml"]
  p13 [algo="p.ml"]
  p14 [algo="p.ml"]
  p15 [algo="p.ml"]
  p16 [algo="p.ml"]
  p17 [algo="p.ml"]
  p18 [algo="p.ml"]
  p19 [algo="p.ml"]
  p20 [algo="p.ml"]
  p21 [algo="p.ml"]
  p22 [algo="p.ml"]
  p23 [algo="p.ml"]
  p24 [algo="p.ml"]
  p25 [algo="p.ml"]
  p26 [algo="p.ml"]
  p27 [algo="p.ml"]
  p28 [algo="p.ml"]
  p29 [algo="p.ml"]
  p30 [algo="p.ml"]
  p31 [algo="p.ml"]
  p32 [algo="p.ml"]
  p33 [algo="p.ml"]
  p34 [algo="p.ml"]
  p35 [algo="p.ml"]
  p36 [algo="p.ml"]
  p37 [algo="p.ml"]
  p38 [algo="p.ml"]
  p39 [algo="p.ml"]
  p40 [algo="p.ml"]
  p41 [algo="p.ml"]
  p42 [algo="p.ml"]
  p43 [algo="p.ml"]
  p44 [algo="p.ml"]
  p45 [algo="p.ml"]
  p46 [algo="p.ml"]
  p47 [algo="p.ml"]
  p48 [algo="p.ml"]
  p49 [algo="p.ml"]
  p50 [algo="p.ml"]
  p51 [algo="p.ml"]
  p52 [algo="p.ml"]
  p53 [algo="p.ml"]
  p54 [algo="p.ml"]
  p55 [algo="p.ml"]
  p56 [algo="p.ml"]
  p57 [algo="p.ml"]
  p58 [algo="p.ml"]
  p59 [algo="p.ml"]
  p60 [algo="p.ml"]
  p61 [algo="p.ml"]
  p62 [algo="p.ml"]
  p63 [algo="p.ml"]
  p64 [algo="p.ml"]
  p65 [algo="p.ml"]
  p66 [algo="p.ml"]
  p67 [algo="p.ml"]
  p68 [algo="p.ml"]
  p69 [algo="p.ml"]
  p70 [algo="p.ml"]
  p71 [algo="p.ml"]
  p72 [algo="p.ml"]
  p73 [algo="p.ml"]
  p74 [algo="p.ml"]
  p75 [algo="p.ml"]
  p76 [algo="p.ml"]
  p77 [algo="p.ml"]
  p78 [algo="p.ml"]
  p79 [algo="p.ml"]
  p80 [algo="p.ml"]
  p81 [algo="p.ml"]
  p82 [algo="p.ml"]
  p83 [algo="p.ml"]
  p84 [algo="p.ml"]
  p85 [algo="p.ml"]
  p86 [algo="p.ml"]
  p87 [algo="p.ml"]
  p88 [algo="p.ml"]
  p89 [algo="p.ml"]
  p90 [algo="p.ml"]
  p91 [algo="p.ml"]
  p92 [algo="p.ml"]
  p93 [algo="p.ml"]
  p94 [algo="p.ml"]
  p95 [algo="p.ml"]
  p96 [algo="p.ml"]
  p97 [algo="p.ml"]
  p98 [algo="p.ml"]
  p99 [algo="p.ml"]
  p100 [algo="p.ml"]
  p101 [algo="p.ml"]
  p102 [algo="p.ml"]
  p103 [algo="p.ml"]
  p104 [algo="p.ml"]
  p105 [algo="p.ml"]
  p106 [algo="p.ml"]
  p107 [algo="p.ml"]
  p108 [algo="p.ml"]
  p109 [algo="p.ml"]
  p110 [algo="p.ml"]
  p111 [algo="p.ml"]
  p112 [algo="p.ml"]
  p113 [algo="p.ml"]
  p114 [algo="p.ml"]
  p115 [algo="p.ml"]
  p116 [algo="p.ml"]
  p117 [algo="p.ml"]
  p118 [algo="p.ml"]
  p119 [algo="p.ml"]
  p120 [algo="p.ml"]
  p121 [algo="p.ml"]
  p122 [algo="p.ml"]
  p123 [algo="p.ml"]
  p124 [algo="p.ml"]
  p125 [algo="p.ml"]
  p126 [algo="p.ml"]
  p127 [algo="p.ml"]
  p128 [algo="p.ml"]
  p129 [algo="p.ml"]
  p130 [algo="p.ml"]
  p131 [algo="p.ml"]
  p132 [algo="p.ml"]
  p133 [algo="p.ml"]
  p134 [algo="p.ml"]
  p135 [algo="p.ml"]
  p136 [algo="p.ml"]
  p137 [algo="p.ml"]
  p138 [algo="p.ml"]
  p139 [algo="p.ml"]
  p140 [algo="p.ml"]
  p141 [algo="p.ml"]
  p142 [algo="p.ml"]
  p143 [algo="p.ml"]
  p144 [algo="p.ml"]
  p145 [algo="p.ml"]
  p146 [algo="p.ml"]
  p147 [algo="p.ml"]
  p148 [algo="p.ml"]
  p149 [algo="p.ml"]
  p150 [algo="p.ml"]
  p151 [algo="p.ml"]
  p152 [algo="p.ml"]
  p153 [algo="p.ml"]
  p154 [algo="p.ml"]
  p155 [algo="p.ml"]
  p156 [algo="p.ml"]
  p157 [algo="p.ml"]
  p158 [algo="p.ml"]
  p159 [algo="p.ml"]
  p160 [algo="p.ml"]
  p161 [algo="p.ml"]
  p162 [algo="p.ml"]
  p163 [algo="p.ml"]
  p164 [algo="p.ml"]
  p165 [algo="p.ml"]
  p166 [algo="p.ml"]
  p167 [algo="p.ml"]
  p168 [algo="p.ml"]
  p169 [algo="p.ml"]
  p170 [algo="p.ml"]
  p171 [algo="p.ml"]
  p172 [algo="p.ml"]
  p173 [algo="p.ml"]
  p174 [algo="p.ml"]
  p175 [algo="p.ml"]
  p176 [algo="p.ml"]
  p177 [algo="p.ml"]
  p178 [algo="p.ml"]
  p179 [algo="p.ml"]
  p180 [algo="p.ml"]
  p181 [algo="p.ml"]
  p182 [algo="p.ml"]
  p183 [algo="p.ml"]
  p184 [algo="p.ml"]
  p185 [algo="p.ml"]
  p186 [algo="p.ml"]
  p187 [algo="p.ml"]
  p188 [algo="p.ml"]
  p189 [algo="p.ml"]
  p190 [algo="p.ml"]
  p191 [algo="p.ml"]
  p192 [algo="p.ml"]
  p193 [algo="p.ml"]
  p194 [algo="p.ml"]
  p195 [algo="p.ml"]
  p196 [algo="p.ml"]
  p197 [algo="p.ml"]
  p198 [algo="p.ml"]
  p199 [algo="p.ml"]
  p200 [algo="p.ml"]
  p201 [algo="p.ml"]
  p202 [algo="p.ml"]
  p203 [algo="p.ml"]
  p204 [algo="p.ml"]
  p205 [algo="p.ml"]
  p206 [algo="p.ml"]
  p207 [algo="p.ml"]
  p208 [algo="p.ml"]
  p209 [algo="p.ml"]
  p210 [algo="p.ml"]
  p211 [algo="p.ml"]
  p212 [algo="p.ml"]
  p213 [algo="p.ml"]
  p214 [algo="p.ml"]
  p215 [algo="p.ml"]
  p216 [algo="p.ml"]
  p217 [algo="p.ml"]
  p218 [algo="p.ml"]
  p219 [algo="p.ml"]
  p220 [algo="p.ml"]
  p221 [algo="p.ml"]
  p222 [algo="p.ml"]
  p223 [algo="p.ml"]
  p224 [algo="p.ml"]
  p225 [algo="p.ml"]
  p226 [algo="p.ml"]
  p227 [algo="p.ml"]
  p228 [algo="p.ml"]
  p229 [algo="p.ml"]
  p230 [algo="p.ml"]
  p231 [algo="p.ml"]
  p232 [algo="p.ml"]
  p233 [algo="p.ml"]
  p234 [algo="p.ml"]
  p235 [algo="p.ml"]
  p236 [algo="p.ml"]
  p237 [algo="p.ml"]
  p238 [algo="p.ml"]
  p239 [algo="p.ml"]
  p240 [algo="p.ml"]
  p241 [algo="p.ml"]
  p242 [algo="p.ml"]
  p243 [algo="p.ml"]
  p244 [algo="p.ml"]
  p245 [algo="p.ml"]
  p246 [algo="p.ml"]
  p247 [algo="p.ml"]
  p248 [algo="p.ml"]
  p249 [algo="p.ml"]
  p250 [algo="p.ml"]
  p251 [algo="p.ml"]
  p252 [algo="p.ml"]
  p253 [algo="p.ml"]
  p254 [algo="p.ml"]
  p255 [algo="p.ml"]
  p256 [algo="p.ml"]
  p257 [algo="p.ml"]
  p258 [algo="p.ml"]
  p259 [algo="p.ml"]
  p260 [algo="p.ml"]
  p261 [algo="p.ml"]
  p262 [algo="p.ml"]
  p263 [algo="p.ml"]
  p264 [algo="p.ml"]
  p265 [algo="p.ml"]
  p266 [algo="p.ml"]
  p267 [algo="p.ml"]
  p268 [algo="p.ml"]
  p269 [algo="p.ml"]
  p270 [algo="p.ml"]
  p271 [algo="p.ml"]
  p272 [algo="p.ml"]
  p273 [algo="p.ml"]
  p274 [algo="p.ml"]
  p275 [algo="p.ml"]
  p276 [algo="p.ml"]
  p277 [algo="p.ml"]
  p278 [algo="p.ml"]
  p279 [algo="p.ml"]
  p280 [algo="p.ml"]
  p281 [algo="p.ml"]
  p282 [algo="p.ml"]
  p283 [algo="p.ml"]
  p284 [algo="p.ml"]
  p285 [algo="p.ml"]
  p286 [algo="p.ml"]
  p287 [algo="p.ml"]
  p288 [algo="p.ml"]
  p289 [algo="p.ml"]
  p290 [algo="p.ml"]
  p291 [algo="p.ml"]
  p292 [algo="p.ml"]
  p293 [algo="p.ml"]
  p294 [algo="p.ml"]
  p295 [algo="p.ml"]
  p296 [algo="p.ml"]
  p297 [algo="p.ml"]
  p298 [algo="p.ml"]
  p299 [algo="p.ml"]
  p300 [algo="p.ml"]
  p301 [algo="p.ml"]
  p302 [algo="p.ml"]
  p303 [algo="p.ml"]
  p304 [algo="p.ml"]
  p305 [algo="p.ml"]
  p306 [algo="p.ml"]
  p307 [algo="p.ml"]
  p308 [algo="p.ml"]
  p309 [algo="p.ml"]
  p310 [algo="p.ml"]
  p311 [algo="p.ml"]
  p312 [algo="p.ml"]
  p313 [algo="p.ml"]
  p314 [algo="p.ml"]
  p315 [algo="p.ml"]
  p316 [algo="p.ml"]
  p317 [algo="p.ml"]
  p318 [algo="p.ml"]
  p319 [algo="p.ml"]
  p320 [algo="p.ml"]
  p321 [algo="p.ml"]
  p322 [algo="p.ml"]
  p323 [algo="p.ml"]
  p324 [algo="p.ml"]
  p325 [algo="p.ml"]
  p326 [algo="p.ml"]
  p327 [algo="p.ml"]
  p328 [algo="p.ml"]
  p329 [algo="p.ml"]
  p330 [algo="p.ml"]
  p331 [algo="p.ml"]
  p332 [algo="p.ml"]
  p333 [algo="p.ml"]
  p334 [algo="p.ml"]
  p335 [algo="p.ml"]
  p336 [algo="p.ml"]
  p337 [algo="p.ml"]
  p338 [algo="p.ml"]
  p339 [algo="p.ml"]
  p340 [algo="p.ml"]
  p341 [algo="p.ml"]
  p342 [algo="p.ml"]
  p343 [algo="p.ml"]
  p344 [algo="p.ml"]
  p345 [algo="p.ml"]
  p346 [algo="p.ml"]
  p347 [algo="p.ml"]
  p348 [algo="p.ml"]
  p349 [algo="p.ml"]
  p350 [algo="p.ml"]
  p351 [algo="p.ml"]
  p352 [algo="p.ml"]
  p353 [algo="p.ml"]
  p354 [algo="p.ml"]
  p355 [algo="p.ml"]
  p356 [algo="p.ml"]
  p357 [algo="p.ml"]
  p358 [algo="p.ml"]
  p359 [algo="p.ml"]
  p360 [algo="p.ml"]
  p361 [algo="p.ml"]
  p362 [algo="p.ml"]
  p363 [algo="p.ml"]
  p364 [algo="p.ml"]
  p365 [algo="p.ml"]
  p366 [algo="p.ml"]
  p367 [algo="p.ml"]
  p368 [algo="p.ml"]
  p369 [algo="p.ml"]
  p370 [algo="p.ml"]
  p371 [algo="p.ml"]
  p372 [algo="p.ml"]
  p373 [algo="p.ml"]
  p374 [algo="p.ml"]
  p375 [algo="p.ml"]
  p376 [algo="p.ml"]
  p377 [algo="p.ml"]
  p378 [algo="p.ml"]
  p379 [algo="p.ml"]
  p380 [algo="p.ml"]
  p381 [algo="p.ml"]
  p382 [algo="p.ml"]
  p383 [algo="p.ml"]
  p384 [algo="p.ml"]
  p385 [algo="p.ml"]
  p386 [algo="p.ml"]
  p387 [algo="p.ml"]
  p388 [algo="p.ml"]
  p389 [algo="p.ml"]
  p390 [algo="p.ml"]
  p391 [algo="p.ml"]
  p392 [algo="p.ml"]
  p393 [algo="p.ml"]
  p394 [algo="p.ml"]
  p395 [algo="p.ml"]
  p396 [algo="p.ml"]
  p397 [algo="p.ml"]
  p398 [algo="p.ml"]
  p399 [algo="p.ml"]
  p400 [algo="p.ml"]
  p401 [algo="p.ml"]
  p402 [algo="p.ml"]
  p403 [algo="p.ml"]
  p404 [algo="p.ml"]
  p405 [algo="p.ml"]
  p406 [algo="p.ml"]
  p407 [algo="p.ml"]
  p408 [algo="p.ml"]
  p409 [algo="p.ml"]
  p410 [algo="p.ml"]
  p411 [algo="p.ml"]
  p412 [algo="p.ml"]
  p413 [algo="p.ml"]
  p414 [algo="p.ml"]
  p415 [algo="p.ml"]
  p416 [algo="p.ml"]
  p417 [algo="p.ml"]
  p418 [algo="p.ml"]
  p419 [algo="p.ml"]
  p420 [algo="p.ml"]
  p421 [algo="p.ml"]
  p422 [algo="p.ml"]
  p423 [algo="p.ml"]
  p424 [algo="p.ml"]
  p425 [algo="p.ml"]
  p426 [algo="p.ml"]
  p427 [algo="p.ml"]
  p428 [algo="p.ml"]
  p429 [algo="p.ml"]
  p430 [algo="p.ml"]
  p431 [algo="p.ml"]
  p432 [algo="p.ml"]
  p433 [algo="p.ml"]
  p434 [algo="p.ml"]
  p435 [algo="p.ml"]
  p436 [algo="p.ml"]
  p437 [algo="p.ml"]
  p438 [algo="p.ml"]
  p439 [algo="p.ml"]
  p440 [algo="p.ml"]
  p441 [algo="p.ml"]
  p442 [algo="p.ml"]
  p443 [algo="p.ml"]
  p444 [algo="p.ml"]
  p445 [algo="p.ml"]
  p446 [algo="p.ml"]
  p447 [algo="p.ml"]
  p448 [algo="p.ml"]
  p449 [algo="p.ml"]
  p450 [algo="p.ml"]
  p451 [algo="p.ml"]
  p452 [algo="p.ml"]
  p453 [algo="p.ml"]
  p454 [algo="p.ml"]
  p455 [algo="p.ml"]
  p456 [algo="p.ml"]
  p457 [algo="p.ml"]
  p458 [algo="p.ml"]
  p459 [algo="p.ml"]
  p460 [algo="p.ml"]
  p461 [algo="p.ml"]
  p462 [algo="p.ml"]
  p463 [algo="p.ml"]
  p464 [algo="p.ml"]
  p465 [algo="p.ml"]
  p466 [algo="p.ml"]
  p467 [algo="p.ml"]
  p468 [algo="p.ml"]
  p469 [algo="p.ml"]
  p470 [algo="p.ml"]
  p471 [algo="p.ml"]
  p472 [algo="p.ml"]
  p473 [algo="p.ml"]
  p474 [algo="p.ml"]
  p475 [algo="p.ml"]
  p476 [algo="p.ml"]
  p477 [algo="p.ml"]
  p478 [algo="p.ml"]
  p479 [algo="p.ml"]
  p480 [algo="p.ml"]
  p481 [algo="p.ml"]
  p482 [algo="p.ml"]
  p483 [algo="p.ml"]
  p484 [algo="p.ml"]
  p485 [algo="p.ml"]
  p486 [algo="p.ml"]
  p487 [algo="p.ml"]
  p488 [algo="p.ml"]
  p489 [algo="p.ml"]
  p490 [algo="p.ml"]
  p491 [algo="p.ml"]
  p492 [algo="p.ml"]
  p493 [algo="p.ml"]
  p494 [algo="p.ml"]
  p495 [algo="p.ml"]
  p496 [algo="p.ml"]
  p497 [algo="p.ml"]
  p498 [algo="p.ml"]
  p499 [algo="p.ml"]
  p500 [algo="p.ml"]
  p501 [algo="p.ml"]
  p502 [algo="p.ml"]
  p503 [algo="p.ml"]
  p504 [algo="p.ml"]
  p505 [algo="p.ml"]
  p506 [algo="p.ml"]
  p507 [algo="p.ml"]
  p508 [algo="p.ml"]
  p509 [algo="p.ml"]
  p510 [algo="p.ml"]
  p511 [algo="p.ml"]
  p512 [algo="p.ml"]
  p513 [algo="p.ml"]
  p514 [algo="p.ml"]
  p515 [algo="p.ml"]
  p516 [algo="p.ml"]
  p517 [algo="p.ml"]
  p518 [algo="p.ml"]
  p519 [algo="p.ml"]
  p520 [algo="p.ml"]
  p521 [algo="p.ml"]
  p522 [algo="p.ml"]
  p523 [algo="p.ml"]
  p524 [algo="p.ml"]
  p525 [algo="p.ml"]
  p526 [algo="p.ml"]
  p527 [algo="p.ml"]
  p528 [algo="p.ml"]
  p529 [algo="p.ml"]
  p530 [algo="p.ml"]
  p531 [algo="p.ml"]
  p532 [algo="p.ml"]
  p533 [algo="p.ml"]
  p534 [algo="p.ml"]
  p535 [algo="p.ml"]
  p536 [algo="p.ml"]
  p537 [algo="p.ml"]
  p538 [algo="p.ml"]
  p539 [algo="p.ml"]
  p540 [algo="p.ml"]
  p541 [algo="p.ml"]
  p542 [algo="p.ml"]
  p543 [algo="p.ml"]
  p544 [algo="p.ml"]
  p545 [algo="p.ml"]
  p546 [algo="p.ml"]
  p547 [algo="p.ml"]
  p548 [algo="p.ml"]
  p549 [algo="p.ml"]
  p550 [algo="p.ml"]
  p551 [algo="p.ml"]
  p552 [algo="p.ml"]
  p553 [algo="p.ml"]
  p554 [algo="p.ml"]
  p555 [algo="p.ml"]
  p556 [algo="p.ml"]
  p557 [algo="p.ml"]
  p558 [algo="p.ml"]
  p559 [algo="p.ml"]
  p560 [algo="p.ml"]
  p561 [algo="p.ml"]
  p562 [algo="p.ml"]
  p563 [algo="p.ml"]
  p564 [algo="p.ml"]
  p565 [algo="p.ml"]
  p566 [algo="p.ml"]
  p567 [algo="p.ml"]
  p568 [algo="p.ml"]
  p569 [algo="p.ml"]
  p570 [algo="p.ml"]
  p571 [algo="p.ml"]
  p572 [algo="p.ml"]
  p573 [algo="p.ml"]
  p574 [algo="p.ml"]
  p575 [algo="p.ml"]
  p576 [algo="p.ml"]
  p577 [algo="p.ml"]
  p578 [algo="p.ml"]
  p579 [algo="p.ml"]
  p580 [algo="p.ml"]
  p581 [algo="p.ml"]
  p582 [algo="p.ml"]
  p583 [algo="p.ml"]
  p584 [algo="p.ml"]
  p585 [algo="p.ml"]
  p586 [algo="p.ml"]
  p587 [algo="p.ml"]
  p588 [algo="p.ml"]
  p589 [algo="p.ml"]
  p590 [algo="p.ml"]
  p591 [algo="p.ml"]
  p592 [algo="p.ml"]
  p593 [algo="p.ml"]
  p594 [algo="p.ml"]
  p595 [algo="p.ml"]
  p596 [algo="p.ml"]
  p597 [algo="p.ml"]
  p598 [algo="p.ml"]
  p599 [algo="p.ml"]
  p600 [algo="p.ml"]
  p601 [algo="p.ml"]
  p602 [algo="p.ml"]
  p603 [algo="p.ml"]
  p604 [algo="p.ml"]
  p605 [algo="p.ml"]
  p606 [algo="p.ml"]
  p607 [algo="p.ml"]
  p608 [algo="p.ml"]
  p609 [algo="p.ml"]
  p610 [algo="p.ml"]
  p611 [algo="p.ml"]
  p612 [algo="p.ml"]
  p613 [algo="p.ml"]
  p614 [algo="p.ml"]
  p615 [algo="p.ml"]
  p616 [algo="p.ml"]
  p617 [algo="p.ml"]
  p618 [algo="p.ml"]
  p619 [algo="p.ml"]
  p620 [algo="p.ml"]
  p621 [algo="p.ml"]
  p622 [algo="p.ml"]
  p623 [algo="p.ml"]
  p624 [algo="p.ml"]
  p625 [algo="p.ml"]
  p626 [algo="p.ml"]
  p627 [algo="p.ml"]
  p628 [algo="p.ml"]
  p629 [algo="p.ml"]
  p630 [algo="p.ml"]
  p631 [algo="p.ml"]
  p632 [algo="p.ml"]
  p633 [algo="p.ml"]
  p634 [algo="p.ml"]
  p635 [algo="p.ml"]
  p636 [algo="p.ml"]
  p637 [algo="p.ml"]
  p638 [algo="p.ml"]
  p639 [algo="p.ml"]
  p640 [algo="p.ml"]
  p641 [algo="p.ml"]
  p642 [algo="p.ml"]
  p643 [algo="p.ml"]
  p644 [algo="p.ml"]
  p645 [algo="p.ml"]
  p646 [algo="p.ml"]
  p647 [algo="p.ml"]
  p648 [algo="p.ml"]
  p649 [algo="p.ml"]
  p650 [algo="p.ml"]
  p651 [algo="p.ml"]
  p652 [algo="p.ml"]
  p653 [algo="p.ml"]
  p654 [algo="p.ml"]
  p655 [algo="p.ml"]
  p656 [algo="p.ml"]
  p657 [algo="p.ml"]
  p658 [algo="p.ml"]
  p659 [algo="p.ml"]
  p660 [algo="p.ml"]
  p661 [algo="p.ml"]
  p662 [algo="p.ml"]
  p663 [algo="p.ml"]
  p664 [algo="p.ml"]
  p665 [algo="p.ml"]
  p666 [algo="p.ml"]
  p667 [algo="p.ml"]
  p668 [algo="p.ml"]
  p669 [algo="p.ml"]
  p670 [algo="p.ml"]
  p671 [algo="p.ml"]
  p672 [algo="p.ml"]
  p673 [algo="p.ml"]
  p674 [algo="p.ml"]
  p675 [algo="p.ml"]
  p676 [algo="p.ml"]
  p677 [algo="p.ml"]
  p678 [algo="p.ml"]
  p679 [algo="p.ml"]
  p680 [algo="p.ml"]
  p681 [algo="p.ml"]
  p682 [algo="p.ml"]
  p683 [algo="p.ml"]
  p684 [algo="p.ml"]
  p685 [algo="p.ml"]
  p686 [algo="p.ml"]
  p687 [algo="p.ml"]
  p688 [algo="p.ml"]
  p689 [algo="p.ml"]
  p690 [algo="p.ml"]
  p691 [algo="p.ml"]
  p692 [algo="p.ml"]
  p693 [algo="p.ml"]
  p694 [algo="p.ml"]
  p695 [algo="p.ml"]
  p696 [algo="p.ml"]
  p697 [algo="p.ml"]
  p698 [algo="p.ml"]
  p699 [algo="p.ml"]
  p700 [algo="p.ml"]
  p701 [algo="p.ml"]
  p702 [algo="p.ml"]
  p703 [algo="p.ml"]
  p704 [algo="p.ml"]
  p705 [algo="p.ml"]
  p706 [algo="p.ml"]
  p707 [algo="p.ml"]
  p708 [algo="p.ml"]
  p709 [algo="p.ml"]
  p710 [algo="p.ml"]
  p711 [algo="p.ml"]
  p712 [algo="p.ml"]
  p713 [algo="p.ml"]
  p714 [algo="p.ml"]
  p715 [algo="p.ml"]
  p716 [algo="p.ml"]
  p717 [algo="p.ml"]
  p718 [algo="p.ml"]
  p719 [algo="p.ml"]
  p720 [algo="p.ml"]
  p721 [algo="p.ml"]
  p722 [algo="p.ml"]
  p723 [algo="p.ml"]
  p724 [algo="p.ml"]
  p725 [algo="p.ml"]
  p726 [algo="p.ml"]
  p727 [algo="p.ml"]
  p728 [algo="p.ml"]
  p729 [algo="p.ml"]
  p730 [algo="p.ml"]
  p731 [algo="p.ml"]
  p732 [algo="p.ml"]
  p733 [algo="p.ml"]
  p734 [algo="p.ml"]
  p735 [algo="p.ml"]
  p736 [algo="p.ml"]
  p737 [algo="p.ml"]
  p738 [algo="p.ml"]
  p739 [algo="p.ml"]
  p740 [algo="p.ml"]
  p741 [algo="p.ml"]
  p742 [algo="p.ml"]
  p743 [algo="p.ml"]
  p744 [algo="p.ml"]
  p745 [algo="p.ml"]
  p746 [algo="p.ml"]
  p747 [algo="p.ml"]
  p748 [algo="p.ml"]
  p749 [algo="p.ml"]
  p750 [algo="p.ml"]
  p751 [algo="p.ml"]
  p752 [algo="p.ml"]
  p753 [algo="p.ml"]
  p754 [algo="p.ml"]
  p755 [algo="p.ml"]
  p756 [algo="p.ml"]
  p757 [algo="p.ml"]
  p758 [algo="p.ml"]
  p759 [algo="p.ml"]
  p760 [algo="p.ml"]
  p761 [algo="p.ml"]
  p762 [algo="p.ml"]
  p763 [algo="p.ml"]
  p764 [algo="p.ml"]
  p765 [algo="p.ml"]
  p766 [algo="p.ml"]
  p767 [algo="p.ml"]
  p768 [algo="p.ml"]
  p769 [algo="p.ml"]
  p770 [algo="p.ml"]
  p771 [algo="p.ml"]
  p772 [algo="p.ml"]
  p773 [algo="p.ml"]
  p774 [algo="p.ml"]
  p775 [algo="p.ml"]
  p776 [algo="p.ml"]
  p777 [algo="p.ml"]
  p778 [algo="p.ml"]
  p779 [algo="p.ml"]
  p780 [algo="p.ml"]
  p781 [algo="p.ml"]
  p782 [algo="p.ml"]
  p783 [algo="p.ml"]
  p784 [algo="p.ml"]
  p785 [algo="p.ml"]
  p786 [algo="p.ml"]
  p787 [algo="p.ml"]
  p788 [algo="p.ml"]
  p789 [algo="p.ml"]
  p790 [algo="p.ml"]
  p791 [algo="p.ml"]
  p792 [algo="p.ml"]
  p793 [algo="p.ml"]
  p794 [algo="p.ml"]
  p795 [algo="p.ml"]
  p796 [algo="p.ml"]
  p797 [algo="p.ml"]
  p798 [algo="p.ml"]
  p799 [algo="p.ml"]
  p800 [algo="p.ml"]
  p801 [algo="p.ml"]
  p802 [algo="p.ml"]
  p803 [algo="p.ml"]
  p804 [algo="p.ml"]
  p805 [algo="p.ml"]
  p806 [algo="p.ml"]
  p807 [algo="p.ml"]
  p808 [algo="p.ml"]
  p809 [algo="p.ml"]
  p810 [algo="p.ml"]
  p811 [algo="p.ml"]
  p812 [algo="p.ml"]
  p813 [algo="p.ml"]
  p814 [algo="p.ml"]
  p815 [algo="p.ml"]
  p816 [algo="p.ml"]
  p817 [algo="p.ml"]
  p818 [algo="p.ml"]
  p819 [algo="p.ml"]
  p820 [algo="p.ml"]
  p821 [algo="p.ml"]
  p822 [algo="p.ml"]
  p823 [algo="p.ml"]
  p824 [algo="p.ml"]
  p825 [algo="p.ml"]
  p826 [algo="p.ml"]
  p827 [algo="p.ml"]
  p828 [algo="p.ml"]
  p829 [algo="p.ml"]
  p830 [algo="p.ml"]
  p831 [algo="p.ml"]
  p832 [algo="p.ml"]
  p833 [algo="p.ml"]
  p834 [algo="p.ml"]
  p835 [algo="p.ml"]
  p836 [algo="p.ml"]
  p837 [algo="p.ml"]
  p838 [algo="p.ml"]
  p839 [algo="p.ml"]
  p840 [algo="p.ml"]
  p841 [algo="p.ml"]
  p842 [algo="p.ml"]
  p843 [algo="p.ml"]
  p844 [algo="p.ml"]
  p845 [algo="p.ml"]
  p846 [algo="p.ml"]
  p847 [algo="p.ml"]
  p848 [algo="p.ml"]
  p849 [algo="p.ml"]
  p850 [algo="p.ml"]
  p851 [algo="p.ml"]
  p852 [algo="p.ml"]
  p853 [algo="p.ml"]
  p854 [algo="p.ml"]
  p855 [algo="p.ml"]
  p856 [algo="p.ml"]
  p857 [algo="p.ml"]
  p858 [algo="p.ml"]
  p859 [algo="p.ml"]
  p860 [algo="p.ml"]
  p861 [algo="p.ml"]
  p862 [algo="p.ml"]
  p863 [algo="p.ml"]
  p864 [algo="p.ml"]
  p865 [algo="p.ml"]
  p866 [algo="p.ml"]
  p867 [algo="p.ml"]
  p868 [algo="p.ml"]
  p869 [algo="p.ml"]
  p870 [algo="p.ml"]
  p871 [algo="p.ml"]
  p872 [algo="p.ml"]
  p873 [algo="p.ml"]
  p874 [algo="p.ml"]
  p875 [algo="p.ml"]
  p876 [algo="p.ml"]
  p877 [algo="p.ml"]
  p878 [algo="p.ml"]
  p879 [algo="p.ml"]
  p880 [algo="p.ml"]
  p881 [algo="p.ml"]
  p882 [algo="p.ml"]
  p883 [algo="p.ml"]
  p884 [algo="p.ml"]
  p885 [algo="p.ml"]
  p886 [algo="p.ml"]
  p887 [algo="p.ml"]
  p888 [algo="p.ml"]
  p889 [algo="p.ml"]
  p890 [algo="p.ml"]
  p891 [algo="p.ml"]
  p892 [algo="p.ml"]
  p893 [algo="p.ml"]
  p894 [algo="p.ml"]
  p895 [algo="p.ml"]
  p896 [algo="p.ml"]
  p897 [algo="p.ml"]
  p898 [algo="p.ml"]
  p899 [algo="p.ml"]
  p900 [algo="p.ml"]
  p901 [algo="p.ml"]
  p902 [algo="p.ml"]
  p903 [algo="p.ml"]
  p904 [algo="p.ml"]
  p905 [algo="p.ml"]
  p906 [algo="p.ml"]
  p907 [algo="p.ml"]
  p908 [algo="p.ml"]
  p909 [algo="p.ml"]
  p910 [algo="p.ml"]
  p911 [algo="p.ml"]
  p912 [algo="p.ml"]
  p913 [algo="p.ml"]
  p914 [algo="p.ml"]
  p915 [algo="p.ml"]
  p916 [algo="p.ml"]
  p917 [algo="p.ml"]
  p918 [algo="p.ml"]
  p919 [algo="p.ml"]
  p920 [algo="p.ml"]
  p921 [algo="p.ml"]
  p922 [algo="p.ml"]
  p923 [algo="p.ml"]
  p924 [algo="p.ml"]
  p925 [algo="p.ml"]
  p926 [algo="p.ml"]
  p927 [algo="p.ml"]
  p928 [algo="p.ml"]
  p929 [algo="p.ml"]
  p930 [algo="p.ml"]
  p931 [algo="p.ml"]
  p932 [algo="p.ml"]
  p933 [algo="p.ml"]
  p934 [algo="p.ml"]
  p935 [algo="p.ml"]
  p936 [algo="p.ml"]
  p937 [algo="p.ml"]
  p938 [algo="p.ml"]
  p939 [algo="p.ml"]
  p940 [algo="p.ml"]
  p941 [algo="p.ml"]
  p942 [algo="p.ml"]
  p943 [algo="p.ml"]
  p944 [algo="p.ml"]
  p945 [algo="p.ml"]
  p946 [algo="p.ml"]
  p947 [algo="p.ml"]
  p948 [algo="p.ml"]
  p949 [algo="p.ml"]
  p950 [algo="p.ml"]
  p951 [algo="p.ml"]
  p952 [algo="p.ml"]
  p953 [algo="p.ml"]
  p954 [algo="p.ml"]
  p955 [algo="p.ml"]
  p956 [algo="p.ml"]
  p957 [algo="p.ml"]
  p958 [algo="p.ml"]
  p959 [algo="p.ml"]
  p960 [algo="p.ml"]
  p961 [algo="p.ml"]
  p962 [algo="p.ml"]
  p963 [algo="p.ml"]
  p964 [algo="p.ml"]
  p965 [algo="p.ml"]
  p966 [algo="p.ml"]
  p967 [algo="p.ml"]
  p968 [algo="p.ml"]
  p969 [algo="p.ml"]
  p970 [algo="p.ml"]
  p971 [algo="p.ml"]
  p972 [algo="p.ml"]
  p973 [algo="p.ml"]
  p974 [algo="p.ml"]
  p975 [algo="p.ml"]
  p976 [algo="p.ml"]
  p977 [algo="p.ml"]
  p978 [algo="p.ml"]
  p979 [algo="p.ml"]
  p980 [algo="p.ml"]
  p981 [algo="p.ml"]
  p982 [algo="p.ml"]
  p983 [algo="p.ml"]
  p984 [algo="p.ml"]
  p985 [algo="p.ml"]
  p986 [algo="p.ml"]
  p987 [algo="p.ml"]
  p988 [algo="p.ml"]
  p989 [algo="p.ml"]
  p990 [algo="p.ml"]
  p991 [algo="p.ml"]
  p992 [algo="p.ml"]
  p993 [algo="p.ml"]
  p994 [algo="p.ml"]
  p995 [algo="p.ml"]
  p996 [algo="p.ml"]
  p997 [algo="p.ml"]
  p998 [algo="p.ml"]
  p999 [algo="p.ml"]

  p0 -> p1
  p1 -> p2
  p10 -> p11
  p100 -> p101
  p101 -> p102
  p102 -> p103
  p103 -> p104
  p104 -> p105
  p105 -> p106
  p106 -> p107
  p107 -> p108
  p108 -> p109
  p109 -> p110
  p11 -> p12
  p110 -> p111
  p111 -> p112
  p112 -> p113
  p113 -> p114
  p114 -> p115
  p115 -> p116
  p116 -> p117
  p117 -> p118
  p118 -> p119
  p119 -> p120
  p12 -> p13
  p120 -> p121
  p121 -> p122
  p122 -> p123
  p123 -> p124
  p124 -> p125
  p125 -> p126
  p126 -> p127
  p127 -> p128
  p128 -> p129
  p129 -> p130
  p13 -> p14
  p130 -> p131
  p131 -> p132
  p132 -> p133
  p133 -> p134
  p134 -> p135
  p135 -> p136
  p136 -> p137
  p137 -> p138
  p138 -> p139
  p139 -> p140
  p14 -> p15
  p140 -> p141
  p141 -> p142
  p142 -> p143
  p143 -> p144
  p144 -> p145
  p145 -> p146
  p146 -> p147
  p147 -> p148
  p148 -> p149
  p149 -> p150
  p15 -> p16
  p150 -> p151
  p151 -> p152
  p152 -> p153
  p153 -> p154
  p154 -> p155
  p155 -> p156
  p156 -> p157
  p157 -> p158
  p158 -> p159
  p159 -> p160
  p16 -> p17
  p160 -> p161
  p161 -> p162
  p162 -> p163
  p163 -> p164
  p164 -> p165
  p165 -> p166
  p166 -> p167
  p167 -> p168
  p168 -> p169
  p169 -> p170
  p17 -> p18
  p170 -> p171
  p171 -> p172
  p172 -> p173
  p173 -> p174
  p174 -> p175
  p175 -> p176
  p176 -> p177
  p177 -> p178
  p178 -> p179
  p179 -> p180
  p18 -> p19
  p180 -> p181
  p181 -> p182
  p182 -> p183
  p183 -> p184
  p184 -> p185
  p185 -> p186
  p186 -> p187
  p187 -> p188
  p188 -> p189
  p189 -> p190
  p19 -> p20
  p190 -> p191
  p191 -> p192
  p192 -> p193
  p193 -> p194
  p194 -> p195
  p195 -> p196
  p196 -> p197
  p197 -> p198
  p198 -> p199
  p199 -> p200
  p2 -> p3
  p20 -> p21
  p200 -> p201
  p201 -> p202
  p202 -> p203
  p203 -> p204
  p204 -> p205
  p205 -> p206
  p206 -> p207
  p207 -> p208
  p208 -> p209
  p209 -> p210
  p21 -> p22
  p210 -> p211
  p211 -> p212
  p212 -> p213
  p213 -> p214
  p214 -> p215
  p215 -> p216
  p216 -> p217
  p217 -> p218
  p218 -> p219
  p219 -> p220
  p22 -> p23
  p220 -> p221
  p221 -> p222
  p222 -> p223
  p223 -> p224
  p224 -> p225
  p225 -> p226
  p226 -> p227
  p227 -> p228
  p228 -> p229
  p229 -> p230
  p23 -> p24
  p230 -> p231
  p231 -> p232
  p232 -> p233
  p233 -> p234
  p234 -> p235
  p235 -> p236
  p236 -> p237
  p237 -> p238
  p238 -> p239
  p239 -> p240
  p24 -> p25
  p240 -> p241
  p241 -> p242
  p242 -> p243
  p243 -> p244
  p244 -> p245
  p245 -> p246
  p246 -> p247
  p247 -> p248
  p248 -> p249
  p249 -> p250
  p25 -> p26
  p250 -> p251
  p251 -> p252
  p252 -> p253
  p253 -> p254
  p254 -> p255
  p255 -> p256
  p256 -> p257
  p257 -> p258
  p258 -> p259
  p259 -> p260
  p26 -> p27
  p260 -> p261
  p261 -> p262
  p262 -> p263
  p263 -> p264
  p264 -> p265
  p265 -> p266
  p266 -> p267
  p267 -> p268
  p268 -> p269
  p269 -> p270
  p27 -> p28
  p270 -> p271
  p271 -> p272
  p272 -> p273
  p273 -> p274
  p274 -> p275
  p275 -> p276
  p276 -> p277
  p277 -> p278
  p278 -> p279
  p279 -> p280
  p28 -> p29
  p280 -> p281
  p281 -> p282
  p282 -> p283
  p283 -> p284
  p284 -> p285
  p285 -> p286
  p286 -> p287
  p287 -> p288
  p288 -> p289
  p289 -> p290
  p29 -> p30
  p290 -> p291
  p291 -> p292
  p292 -> p293
  p293 -> p294
  p294 -> p295
  p295 -> p296
  p296 -> p297
  p297 -> p298
  p298 -> p299
  p299 -> p300
  p3 -> p4
  p30 -> p31
  p300 -> p301
  p301 -> p302
  p302 -> p303
  p303 -> p304
  p304 -> p305
  p305 -> p306
  p306 -> p307
  p307 -> p308
  p308 -> p309
  p309 -> p310
  p31 -> p32
  p310 -> p311
  p311 -> p312
  p312 -> p313
  p313 -> p314
  p314 -> p315
  p315 -> p316
  p316 -> p317
  p317 -> p318
  p318 -> p319
  p319 -> p320
  p32 -> p33
  p320 -> p321
  p321 -> p322
  p322 -> p323
  p323 -> p324
  p324 -> p325
  p325 -> p326
  p326 -> p327
  p327 -> p328
  p328 -> p329
  p329 -> p330
  p33 -> p34
  p330 -> p331
  p331 -> p332
  p332 -> p333
  p333 -> p334
  p334 -> p335
  p335 -> p336
  p336 -> p337
  p337 -> p338
  p338 -> p339
  p339 -> p340
  p34 -> p35
  p340 -> p341
  p341 -> p342
  p342 -> p343
  p343 -> p344
  p344 -> p345
  p345 -> p346
  p346 -> p347
  p347 -> p348
  p348 -> p349
  p349 -> p350
  p35 -> p36
  p350 -> p351
  p351 -> p352
  p352 -> p353
  p353 -> p354
  p354 -> p355
  p355 -> p356
  p356 -> p357
  p357 -> p358
  p358 -> p359
  p359 -> p360
  p36 -> p37
  p360 -> p361
  p361 -> p362
  p362 -> p363
  p363 -> p364
  p364 -> p365
  p365 -> p366
  p366 -> p367
  p367 -> p368
  p368 -> p369
  p369 -> p370
  p37 -> p38
  p370 -> p371
  p371 -> p372
  p372 -> p373
  p373 -> p374
  p374 -> p375
  p375 -> p376
  p376 -> p377
  p377 -> p378
  p378 -> p379
  p379 -> p380
  p38 -> p39
  p380 -> p381
  p381 -> p382
  p382 -> p383
  p383 -> p384
  p384 -> p385
  p385 -> p386
  p386 -> p387
  p387 -> p388
  p388 -> p389
  p389 -> p390
  p39 -> p40
  p390 -> p391
  p391 -> p392
  p392 -> p393
  p393 -> p394
  p394 -> p395
  p395 -> p396
  p396 -> p397
  p397 -> p398
  p398 -> p399
  p399 -> p400
  p4 -> p5
  p40 -> p41
  p400 -> p401
  p401 -> p402
  p402 -> p403
  p403 -> p404
  p404 -> p405
  p405 -> p406
  p406 -> p407
  p407 -> p408
  p408 -> p409
  p409 -> p410
  p41 -> p42
  p410 -> p411
  p411 -> p412
  p412 -> p413
  p413 -> p414
  p414 -> p415
  p415 -> p416
  p416 -> p417
  p417 -> p418
  p418 -> p419
  p419 -> p420
  p42 -> p43
  p420 -> p421
  p421 -> p422
  p422 -> p423
  p423 -> p424
  p424 -> p425
  p425 -> p426
  p426 -> p427
  p427 -> p428
  p428 -> p429
  p429 -> p430
  p43 -> p44
  p430 -> p431
  p431 -> p432
  p432 -> p433
  p433 -> p434
  p434 -> p435
  p435 -> p436
  p436 -> p437
  p437 -> p438
  p438 -> p439
  p439 -> p440
  p44 -> p45
  p440 -> p441
  p441 -> p442
  p442 -> p443
  p443 -> p444
  p444 -> p445
  p445 -> p446
  p446 -> p447
  p447 -> p448
  p448 -> p449
  p449 -> p450
  p45 -> p46
  p450 -> p451
  p451 -> p452
  p452 -> p453
  p453 -> p454
  p454 -> p455
  p455 -> p456
  p456 -> p457
  p457 -> p458
  p458 -> p459
  p459 -> p460
  p46 -> p47
  p460 -> p461
  p461 -> p462
  p462 -> p463
  p463 -> p464
  p464 -> p465
  p465 -> p466
  p466 -> p467
  p467 -> p468
  p468 -> p469
  p469 -> p470
  p47 -> p48
  p470 -> p471
  p471 -> p472
  p472 -> p473
  p473 -> p474
  p474 -> p475
  p475 -> p476
  p476 -> p477
  p477 -> p478
  p478 -> p479
  p479 -> p480
  p48 -> p49
  p480 -> p481
  p481 -> p482
  p482 -> p483
  p483 -> p484
  p484 -> p485
  p485 -> p486
  p486 -> p487
  p487 -> p488
  p488 -> p489
  p489 -> p490
  p49 -> p50
  p490 -> p491
  p491 -> p492
  p492 -> p493
  p493 -> p494
  p494 -> p495
  p495 -> p496
  p496 -> p497
  p497 -> p498
  p498 -> p499
  p499 -> p500
  p5 -> p6
  p50 -> p51
  p500 -> p501
  p501 -> p502
  p502 -> p503
  p503 -> p504
  p504 -> p505
  p505 -> p506
  p506 -> p507
  p507 -> p508
  p508 -> p509
  p509 -> p510
  p51 -> p52
  p510 -> p511
  p511 -> p512
  p512 -> p513
  p513 -> p514
  p514 -> p515
  p515 -> p516
  p516 -> p517
  p517 -> p518
  p518 -> p519
  p519 -> p520
  p52 -> p53
  p520 -> p521
  p521 -> p522
  p522 -> p523
  p523 -> p524
  p524 -> p525
  p525 -> p526
  p526 -> p527
  p527 -> p528
  p528 -> p529
  p529 -> p530
  p53 -> p54
  p530 -> p531
  p531 -> p532
  p532 -> p533
  p533 -> p534
  p534 -> p535
  p535 -> p536
  p536 -> p537
  p537 -> p538
  p538 -> p539
  p539 -> p540
  p54 -> p55
  p540 -> p541
  p541 -> p542
  p542 -> p543
  p543 -> p544
  p544 -> p545
  p545 -> p546
  p546 -> p547
  p547 -> p548
  p548 -> p549
  p549 -> p550
  p55 -> p56
  p550 -> p551
  p551 -> p552
  p552 -> p553
  p553 -> p554
  p554 -> p555
  p555 -> p556
  p556 -> p557
  p557 -> p558
  p558 -> p559
  p559 -> p560
  p56 -> p57
  p560 -> p561
  p561 -> p562
  p562 -> p563
  p563 -> p564
  p564 -> p565
  p565 -> p566
  p566 -> p567
  p567 -> p568
  p568 -> p569
  p569 -> p570
  p57 -> p58
  p570 -> p571
  p571 -> p572
  p572 -> p573
  p573 -> p574
  p574 -> p575
  p575 -> p576
  p576 -> p577
  p577 -> p578
  p578 -> p579
  p579 -> p580
  p58 -> p59
  p580 -> p581
  p581 -> p582
  p582 -> p583
  p583 -> p584
  p584 -> p585
  p585 -> p586
  p586 -> p587
  p587 -> p588
  p588 -> p589
  p589 -> p590
  p59 -> p60
  p590 -> p591
  p591 -> p592
  p592 -> p593
  p593 -> p594
  p594 -> p595
  p595 -> p596
  p596 -> p597
  p597 -> p598
  p598 -> p599
  p599 -> p600
  p6 -> p7
  p60 -> p61
  p600 -> p601
  p601 -> p602
  p602 -> p603
  p603 -> p604
  p604 -> p605
  p605 -> p606
  p606 -> p607
  p607 -> p608
  p608 -> p609
  p609 -> p610
  p61 -> p62
  p610 -> p611
  p611 -> p612
  p612 -> p613
  p613 -> p614
  p614 -> p615
  p615 -> p616
  p616 -> p617
  p617 -> p618
  p618 -> p619
  p619 -> p620
  p62 -> p63
  p620 -> p621
  p621 -> p622
  p622 -> p623
  p623 -> p624
  p624 -> p625
  p625 -> p626
  p626 -> p627
  p627 -> p628
  p628 -> p629
  p629 -> p630
  p63 -> p64
  p630 -> p631
  p631 -> p632
  p632 -> p633
  p633 -> p634
  p634 -> p635
  p635 -> p636
  p636 -> p637
  p637 -> p638
  p638 -> p639
  p639 -> p640
  p64 -> p65
  p640 -> p641
  p641 -> p642
  p642 -> p643
  p643 -> p644
  p644 -> p645
  p645 -> p646
  p646 -> p647
  p647 -> p648
  p648 -> p649
  p649 -> p650
  p65 -> p66
  p650 -> p651
  p651 -> p652
  p652 -> p653
  p653 -> p654
  p654 -> p655
  p655 -> p656
  p656 -> p657
  p657 -> p658
  p658 -> p659
  p659 -> p660
  p66 -> p67
  p660 -> p661
  p661 -> p662
  p662 -> p663
  p663 -> p664
  p664 -> p665
  p665 -> p666
  p666 -> p667
  p667 -> p668
  p668 -> p669
  p669 -> p670
  p67 -> p68
  p670 -> p671
  p671 -> p672
  p672 -> p673
  p673 -> p674
  p674 -> p675
  p675 -> p676
  p676 -> p677
  p677 -> p678
  p678 -> p679
  p679 -> p680
  p68 -> p69
  p680 -> p681
  p681 -> p682
  p682 -> p683
  p683 -> p684
  p684 -> p685
  p685 -> p686
  p686 -> p687
  p687 -> p688
  p688 -> p689
  p689 -> p690
  p69 -> p70
  p690 -> p691
  p691 -> p692
  p692 -> p693
  p693 -> p694
  p694 -> p695
  p695 -> p696
  p696 -> p697
  p697 -> p698
  p698 -> p699
  p699 -> p700
  p7 -> p8
  p70 -> p71
  p700 -> p701
  p701 -> p702
  p702 -> p703
  p703 -> p704
  p704 -> p705
  p705 -> p706
  p706 -> p707
  p707 -> p708
  p708 -> p709
  p709 -> p710
  p71 -> p72
  p710 -> p711
  p711 -> p712
  p712 -> p713
  p713 -> p714
  p714 -> p715
  p715 -> p716
  p716 -> p717
  p717 -> p718
  p718 -> p719
  p719 -> p720
  p72 -> p73
  p720 -> p721
  p721 -> p722
  p722 -> p723
  p723 -> p724
  p724 -> p725
  p725 -> p726
  p726 -> p727
  p727 -> p728
  p728 -> p729
  p729 -> p730
  p73 -> p74
  p730 -> p731
  p731 -> p732
  p732 -> p733
  p733 -> p734
  p734 -> p735
  p735 -> p736
  p736 -> p737
  p737 -> p738
  p738 -> p739
  p739 -> p740
  p74 -> p75
  p740 -> p741
  p741 -> p742
  p742 -> p743
  p743 -> p744
  p744 -> p745
  p745 -> p746
  p746 -> p747
  p747 -> p748
  p748 -> p749
  p749 -> p750
  p75 -> p76
  p750 -> p751
  p751 -> p752
  p752 -> p753
  p753 -> p754
  p754 -> p755
  p755 -> p756
  p756 -> p757
  p757 -> p758
  p758 -> p759
  p759 -> p760
  p76 -> p77
  p760 -> p761
  p761 -> p762
  p762 -> p763
  p763 -> p764
  p764 -> p765
  p765 -> p766
  p766 -> p767
  p767 -> p768
  p768 -> p769
  p769 -> p770
  p77 -> p78
  p770 -> p771
  p771 -> p772
  p772 -> p773
  p773 -> p774
  p774 -> p775
  p775 -> p776
  p776 -> p777
  p777 -> p778
  p778 -> p779
  p779 -> p780
  p78 -> p79
  p780 -> p781
  p781 -> p782
  p782 -> p783
  p783 -> p784
  p784 -> p785
  p785 -> p786
  p786 -> p787
  p787 -> p788
  p788 -> p789
  p789 -> p790
  p79 -> p80
  p790 -> p791
  p791 -> p792
  p792 -> p793
  p793 -> p794
  p794 -> p795
  p795 -> p796
  p796 -> p797
  p797 -> p798
  p798 -> p799
  p799 -> p800
  p8 -> p9
  p80 -> p81
  p800 -> p801
  p801 -> p802
  p802 -> p803
  p803 -> p804
  p804 -> p805
  p805 -> p806
  p806 -> p807
  p807 -> p808
  p808 -> p809
  p809 -> p810
  p81 -> p82
  p810 -> p811
  p811 -> p812
  p812 -> p813
  p813 -> p814
  p814 -> p815
  p815 -> p816
  p816 -> p817
  p817 -> p818
  p818 -> p819
  p819 -> p820
  p82 -> p83
  p820 -> p821
  p821 -> p822
  p822 -> p823
  p823 -> p824
  p824 -> p825
  p825 -> p826
  p826 -> p827
  p827 -> p828
  p828 -> p829
  p829 -> p830
  p83 -> p84
  p830 -> p831
  p831 -> p832
  p832 -> p833
  p833 -> p834
  p834 -> p835
  p835 -> p836
  p836 -> p837
  p837 -> p838
  p838 -> p839
  p839 -> p840
  p84 -> p85
  p840 -> p841
  p841 -> p842
  p842 -> p843
  p843 -> p844
  p844 -> p845
  p845 -> p846
  p846 -> p847
  p847 -> p848
  p848 -> p849
  p849 -> p850
  p85 -> p86
  p850 -> p851
  p851 -> p852
  p852 -> p853
  p853 -> p854
  p854 -> p855
  p855 -> p856
  p856 -> p857
  p857 -> p858
  p858 -> p859
  p859 -> p860
  p86 -> p87
  p860 -> p861
  p861 -> p862
  p862 -> p863
  p863 -> p864
  p864 -> p865
  p865 -> p866
  p866 -> p867
  p867 -> p868
  p868 -> p869
  p869 -> p870
  p87 -> p88
  p870 -> p871
  p871 -> p872
  p872 -> p873
  p873 -> p874
  p874 -> p875
  p875 -> p876
  p876 -> p877
  p877 -> p878
  p878 -> p879
  p879 -> p880
  p88 -> p89
  p880 -> p881
  p881 -> p882
  p882 -> p883
  p883 -> p884
  p884 -> p885
  p885 -> p886
  p886 -> p887
  p887 -> p888
  p888 -> p889
  p889 -> p890
  p89 -> p90
  p890 -> p891
  p891 -> p892
  p892 -> p893
  p893 -> p894
  p894 -> p895
  p895 -> p896
  p896 -> p897
  p897 -> p898
  p898 -> p899
  p899 -> p900
  p9 -> p10
  p90 -> p91
  p900 -> p901
  p901 -> p902
  p902 -> p903
  p903 -> p904
  p904 -> p905
  p905 -> p906
  p906 -> p907
  p907 -> p908
  p908 -> p909
  p909 -> p910
  p91 -> p92
  p910 -> p911
  p911 -> p912
  p912 -> p913
  p913 -> p914
  p914 -> p915
  p915 -> p916
  p916 -> p917
  p917 -> p918
  p918 -> p919
  p919 -> p920
  p92 -> p93
  p920 -> p921
  p921 -> p922
  p922 -> p923
  p923 -> p924
  p924 -> p925
  p925 -> p926
  p926 -> p927
  p927 -> p928
  p928 -> p929
  p929 -> p930
  p93 -> p94
  p930 -> p931
  p931 -> p932
  p932 -> p933
  p933 -> p934
  p934 -> p935
  p935 -> p936
  p936 -> p937
  p937 -> p938
  p938 -> p939
  p939 -> p940
  p94 -> p95
  p940 -> p941
  p941 -> p942
  p942 -> p943
  p943 -> p944
  p944 -> p945
  p945 -> p946
  p946 -> p947
  p947 -> p948
  p948 -> p949
  p949 -> p950
  p95 -> p96
  p950 -> p951
  p951 -> p952
  p952 -> p953
  p953 -> p954
  p954 -> p955
  p955 -> p956
  p956 -> p957
  p957 -> p958
  p958 -> p959
  p959 -> p960
  p96 -> p97
  p960 -> p961
  p961 -> p962
  p962 -> p963
  p963 -> p964
  p964 -> p965
  p965 -> p966
  p966 -> p967
  p967 -> p968
  p968 -> p969
  p969 -> p970
  p97 -> p98
  p970 -> p971
  p971 -> p972
  p972 -> p973
  p973 -> p974
  p974 -> p975
  p975 -> p976
  p976 -> p977
  p977 -> p978
  p978 -> p979
  p979 -> p980
  p98 -> p99
  p980 -> p981
  p981 -> p982
  p982 -> p983
  p983 -> p984
  p984 -> p985
  p985 -> p986
  p986 -> p987
  p987 -> p988
  p988 -> p989
  p989 -> p990
  p99 -> p100
  p990 -> p991
  p991 -> p992
  p992 -> p993
  p993 -> p994
  p994 -> p995
  p995 -> p996
  p996 -> p997
  p997 -> p998
  p998 -> p999
  p999 -> p0
}

