* gnetlist -g spice-sdb -o spice.net buck_converter.sch
*********************************************************
* Spice file generated by gnetlist                      *
* spice-sdb version 4.28.2007 by SDB --                 *
* provides advanced spice netlisting capability.        *
* Documentation at http://www.brorson.com/gEDA/SPICE/   *
*********************************************************
* To run: ngspice -b spice.net > result.txt
*==============  Begin SPICE netlist of main design ============
.INCLUDE simulation.cmd
.model MyDiode D(RS=1e-6)
.model MySwitch SW(VT=0  VH=0 RON=1e-4 ROFF=1e7)
V2 vpulse 0 pulse -1 1 0 0 0 5u 10u
S1 2 0 vpulse 0 MySwitch
C1 0 vout 33.33e-6
R1 0 vout 6 
L1 1 2 150e-6
V1 1 0 6
D1 2 vout MyDiode 
.end
