v 20130925 2
C 40000 40000 0 0 0 title-B.sym
C 49600 46700 1 0 0 diode-1.sym
{
T 50000 47300 5 10 0 0 0 0 1
device=DIODE
T 49900 47200 5 10 1 1 0 0 1
refdes=D1
}
C 42100 46500 1 0 0 inductor-1.sym
{
T 42300 47000 5 10 0 0 0 0 1
device=INDUCTOR
T 42300 47200 5 10 0 0 0 0 1
symversion=0.1
T 42100 46300 5 10 1 0 0 0 1
value=500e-6
T 42200 46900 5 10 1 0 0 0 1
refdes=L1
}
C 46700 46700 1 0 0 capacitor-1.sym
{
T 46900 47400 5 10 0 0 0 0 1
device=CAPACITOR
T 46900 47200 5 10 1 1 0 0 1
refdes=C1
T 46900 47600 5 10 0 0 0 0 1
symversion=0.1
T 46700 46700 5 10 1 0 0 0 1
value=47e-6
}
C 43800 46500 1 0 0 resistor-1.sym
{
T 44100 46900 5 10 0 0 0 0 1
device=RESISTOR
T 44000 46800 5 10 1 1 0 0 1
refdes=R1
T 43700 46200 5 10 1 0 0 0 1
value=100e-3
}
C 41400 46300 1 270 0 voltage-3.sym
{
T 42100 46100 5 8 0 0 270 0 1
device=VOLTAGE_SOURCE
T 41900 46000 5 10 1 1 270 0 1
refdes=V1
}
C 48500 45700 1 90 0 inductor-1.sym
{
T 48000 45900 5 10 0 0 90 0 1
device=INDUCTOR
T 48200 45900 5 10 1 1 90 0 1
refdes=L2
T 47800 45900 5 10 0 0 90 0 1
symversion=0.1
T 48500 45700 5 10 1 0 0 0 1
value=100e-6
}
C 48500 44500 1 90 0 resistor-1.sym
{
T 48100 44800 5 10 0 0 90 0 1
device=RESISTOR
T 48200 44700 5 10 1 1 90 0 1
refdes=R2
T 48500 44500 5 10 1 0 0 0 1
value=20e-3
}
C 51200 44900 1 90 0 capacitor-1.sym
{
T 50500 45100 5 10 0 0 90 0 1
device=CAPACITOR
T 50700 45100 5 10 1 1 90 0 1
refdes=C2
T 50300 45100 5 10 0 0 90 0 1
symversion=0.1
T 51200 44900 5 10 1 0 0 0 1
value=200e-6
}
C 53000 45000 1 90 0 resistor-1.sym
{
T 52600 45300 5 10 0 0 90 0 1
device=RESISTOR
T 52700 45200 5 10 1 1 90 0 1
refdes=R3
T 53000 45000 5 10 1 0 0 0 1
value=50
}
N 41600 46300 41600 46600 4
N 41600 46600 42100 46600 4
N 43000 46600 43800 46600 4
N 44700 46600 46700 46600 4
N 46700 46600 46700 46900 4
N 47600 46900 49600 46900 4
N 48400 46600 48400 46900 4
N 48400 45400 48400 45700 4
N 50500 46900 53600 46900 4
N 52900 46900 52900 45900 4
N 51000 45800 51000 46900 4
N 52900 45000 52900 43800 4
N 41600 43800 52900 43800 4
N 41600 43800 41600 45400 4
N 51000 44900 51000 43800 4
N 48400 44500 48400 43800 4
N 43200 44200 43200 43800 4
N 42600 45200 45100 45200 4
N 45500 46600 45700 45700 4
N 45700 44700 45500 43800 4
C 41600 43000 1 0 0 ground.sym
N 41800 43300 41800 43800 4
C 45100 44700 1 0 0 spice-npn-1.sym
{
T 46000 45400 5 10 0 0 0 0 1
device=SPICE-NPN
T 46000 45200 5 10 1 1 0 0 1
refdes=Q1
}
C 42100 44100 1 0 0 vpulse-1.sym
{
T 42800 44750 5 10 1 1 0 0 1
refdes=V2
T 42800 44950 5 10 0 0 0 0 1
device=vpulse
T 42800 45150 5 10 0 0 0 0 1
footprint=none
T 42800 44550 5 10 1 1 0 0 1
value=pulse 0 1 10n 10n 100n 1u 2u
}
N 42600 45200 42400 45300 4
N 43200 44200 42900 44200 4
N 42900 44200 42400 44100 4
C 44200 42400 1 0 0 gnucap-include-1.sym
{
T 44300 42600 5 10 0 1 0 0 1
device=include
T 44300 42700 5 10 1 1 0 0 1
refdes=A1
T 44700 42400 5 10 1 1 0 0 1
file=simulation.cmd
}
N 53600 46900 53600 47000 4
{
T 53600 46900 5 10 1 0 0 0 1
netname=vout
}
