Name,Affiliation,Role
Christos Kozyrakis,Stanford University,PC Chair
Ali Adl-Tabatabai,Google,PC
Jung Ho Ahn,SNU,PC
Valeria Bertacco,University of Michigan,PC
Pradip Bose,IBM Research,PC
David Brooks,Harvard,PC
John Carter,IBM Research,PC
Jichuan Chang,HP,PC
Jason Cong,UCLA,PC
Tom Conte,Georgia Tech,PC
John Davis,Microsoft Research,PC
Greg Diamos,NVIDIA,PC
Lieven Eeckhout,Ghent University,PC
Mattan Erez,University of Texas at Austin,PC
Antonio González,Intel & UPC,PC
Boris Grot,EPFL,PC
Ron Ho,Oracle Labs,PC
James Hoe,CMU,PC
Chris Hughes,Intel,PC
Hillery Hunter,IBM Research,PC
Wen-Mei Hwu,University of Illinois at Urbana-Champaign,PC
Engin İpek,University of Rochester,PC
Ravi Iyer,Intel,PC
Nuwan Jayasena,AMD Research,PC
Stefanos Kaxiras,Uppsala University,PC
Hyesoon Kim,Georgia Tech,PC
Benjamin Lee,Duke,PC
Scott Mahlke,University of Michigan,PC
Jason Mars,UCSD,PC
Kathryn McKinley,Microsoft Research,PC
Andreas Moshovos,University of Toronto,PC
Satish Narayanasamy,University of Michigan,PC
Milos Prvulovic,Georgia Tech,PC
Vijay Janapa Reddi,University of Texas at Austin,PC
Daniel Sanchez,MIT,PC
Karu Sankaralingam,University of Wisconsin,PC
Yannos Sazeides,University of Cyprus,PC
Simha Sethumadhavan,Columbia,PC
Steve Swanson,UCSD,PC
Olivier Temam,INRIA,PC
Kees Vissers,Xilinx,PC