(module logo_phelma_32x21mm (layer F.Cu) (tedit 5DA9B4BE)
  (fp_text reference G*** (at 0 0) (layer F.SilkS) hide
    (effects (font (size 1.524 1.524) (thickness 0.3)))
  )
  (fp_text value LOGO (at 0.75 0) (layer F.SilkS) hide
    (effects (font (size 1.524 1.524) (thickness 0.3)))
  )
  (fp_poly (pts (xy 2.357513 0.077201) (xy 2.360161 0.087518) (xy 2.363513 0.112357) (xy 2.367369 0.149329)
    (xy 2.371532 0.196048) (xy 2.375804 0.250125) (xy 2.379985 0.309173) (xy 2.383879 0.370805)
    (xy 2.387285 0.432631) (xy 2.387668 0.440267) (xy 2.395538 0.763549) (xy 2.387388 1.087794)
    (xy 2.36343 1.411725) (xy 2.323877 1.734067) (xy 2.268941 2.053543) (xy 2.198835 2.368877)
    (xy 2.11377 2.678793) (xy 2.01396 2.982016) (xy 1.926547 3.211727) (xy 1.89752 3.283598)
    (xy 1.87411 3.341336) (xy 1.855534 3.386485) (xy 1.84101 3.420588) (xy 1.829755 3.445191)
    (xy 1.820986 3.461838) (xy 1.813919 3.472072) (xy 1.807773 3.477438) (xy 1.801764 3.479479)
    (xy 1.79511 3.479741) (xy 1.7907 3.479685) (xy 1.774907 3.476255) (xy 1.746844 3.466729)
    (xy 1.70954 3.452273) (xy 1.666024 3.434052) (xy 1.626626 3.416571) (xy 1.581924 3.396098)
    (xy 1.542735 3.377916) (xy 1.511599 3.363223) (xy 1.491051 3.353213) (xy 1.483697 3.349186)
    (xy 1.485421 3.340389) (xy 1.49283 3.3186) (xy 1.504956 3.2864) (xy 1.520832 3.246367)
    (xy 1.536994 3.207049) (xy 1.571003 3.125042) (xy 1.599652 3.054573) (xy 1.624433 2.991696)
    (xy 1.646843 2.932464) (xy 1.668374 2.872932) (xy 1.69052 2.809153) (xy 1.713929 2.73972)
    (xy 1.805392 2.441364) (xy 1.881246 2.140767) (xy 1.941797 1.836333) (xy 1.987351 1.526466)
    (xy 2.018214 1.209572) (xy 2.024243 1.119732) (xy 2.027048 1.058679) (xy 2.028997 0.984518)
    (xy 2.030124 0.900302) (xy 2.030463 0.809087) (xy 2.030049 0.713927) (xy 2.028915 0.617877)
    (xy 2.027096 0.523991) (xy 2.024626 0.435325) (xy 2.021539 0.354934) (xy 2.01787 0.285872)
    (xy 2.014397 0.239243) (xy 2.010864 0.195875) (xy 2.008461 0.158778) (xy 2.007345 0.131084)
    (xy 2.007671 0.115928) (xy 2.0082 0.114112) (xy 2.017595 0.111876) (xy 2.040676 0.108445)
    (xy 2.07437 0.104142) (xy 2.115608 0.099292) (xy 2.161319 0.094221) (xy 2.208432 0.089251)
    (xy 2.253877 0.084708) (xy 2.294582 0.080915) (xy 2.327478 0.078199) (xy 2.349493 0.076882)
    (xy 2.357513 0.077201)) (layer F.Mask) (width 0.01))
  (fp_poly (pts (xy 1.472144 -0.342457) (xy 1.476364 -0.331197) (xy 1.48221 -0.305284) (xy 1.489365 -0.266882)
    (xy 1.497509 -0.21816) (xy 1.506325 -0.161285) (xy 1.515494 -0.098423) (xy 1.524698 -0.031741)
    (xy 1.533619 0.036593) (xy 1.541939 0.104413) (xy 1.549339 0.169553) (xy 1.554149 0.2159)
    (xy 1.558785 0.273488) (xy 1.562865 0.344977) (xy 1.566347 0.42734) (xy 1.569188 0.517552)
    (xy 1.571344 0.612589) (xy 1.572773 0.709425) (xy 1.573432 0.805035) (xy 1.573278 0.896393)
    (xy 1.572268 0.980474) (xy 1.570359 1.054253) (xy 1.567509 1.114705) (xy 1.566999 1.12241)
    (xy 1.541827 1.404231) (xy 1.505797 1.675582) (xy 1.458292 1.939474) (xy 1.398699 2.19892)
    (xy 1.326401 2.456934) (xy 1.242578 2.711451) (xy 1.232112 2.736994) (xy 1.222186 2.754428)
    (xy 1.215949 2.759617) (xy 1.205402 2.756648) (xy 1.181576 2.748677) (xy 1.147064 2.736613)
    (xy 1.104455 2.721362) (xy 1.056341 2.703831) (xy 1.050285 2.701604) (xy 1.002109 2.683506)
    (xy 0.959669 2.666865) (xy 0.925435 2.652706) (xy 0.901878 2.642055) (xy 0.891469 2.635941)
    (xy 0.891208 2.635525) (xy 0.892675 2.624188) (xy 0.899027 2.601168) (xy 0.909069 2.570587)
    (xy 0.914291 2.555955) (xy 0.929826 2.511148) (xy 0.948437 2.453792) (xy 0.968971 2.387732)
    (xy 0.990276 2.316817) (xy 1.011199 2.244893) (xy 1.030587 2.175807) (xy 1.047287 2.113407)
    (xy 1.049718 2.103967) (xy 1.113974 1.81948) (xy 1.162829 1.529471) (xy 1.196173 1.235689)
    (xy 1.213895 0.939886) (xy 1.215886 0.643812) (xy 1.202036 0.349218) (xy 1.176198 0.0889)
    (xy 1.168913 0.032769) (xy 1.160788 -0.025902) (xy 1.152279 -0.084189) (xy 1.143843 -0.139167)
    (xy 1.135936 -0.18791) (xy 1.129012 -0.227494) (xy 1.12353 -0.254993) (xy 1.121088 -0.264583)
    (xy 1.118436 -0.27695) (xy 1.119146 -0.279407) (xy 1.127885 -0.280921) (xy 1.150767 -0.285148)
    (xy 1.185307 -0.291621) (xy 1.229016 -0.299872) (xy 1.279407 -0.309436) (xy 1.2954 -0.312481)
    (xy 1.347325 -0.322204) (xy 1.393353 -0.330501) (xy 1.43099 -0.336948) (xy 1.457742 -0.341122)
    (xy 1.471115 -0.342601) (xy 1.472144 -0.342457)) (layer F.SilkS) (width 0.01))
  (fp_poly (pts (xy 5.414108 0.635335) (xy 5.416123 0.688745) (xy 5.416809 0.756641) (xy 5.416251 0.836636)
    (xy 5.414534 0.92634) (xy 5.411742 1.023367) (xy 5.40796 1.125327) (xy 5.403274 1.229834)
    (xy 5.397769 1.334499) (xy 5.391528 1.436934) (xy 5.384638 1.534751) (xy 5.380102 1.591734)
    (xy 5.363357 1.768674) (xy 5.342123 1.95506) (xy 5.317266 2.144269) (xy 5.289646 2.329681)
    (xy 5.26365 2.484967) (xy 5.253865 2.539253) (xy 5.246163 2.579051) (xy 5.239908 2.60659)
    (xy 5.234463 2.624094) (xy 5.22919 2.633791) (xy 5.223453 2.637907) (xy 5.2197 2.638612)
    (xy 5.206274 2.637361) (xy 5.179237 2.633128) (xy 5.141544 2.626437) (xy 5.096153 2.617812)
    (xy 5.048199 2.608223) (xy 4.999127 2.597953) (xy 4.955879 2.588475) (xy 4.921157 2.580413)
    (xy 4.897661 2.574395) (xy 4.888106 2.571062) (xy 4.887741 2.561344) (xy 4.890106 2.53773)
    (xy 4.89483 2.502974) (xy 4.901541 2.459826) (xy 4.909134 2.415185) (xy 4.968968 2.029712)
    (xy 5.013195 1.640133) (xy 5.041585 1.24907) (xy 5.053907 0.859143) (xy 5.054448 0.765411)
    (xy 5.0546 0.544454) (xy 5.14985 0.538966) (xy 5.199777 0.536561) (xy 5.254335 0.534683)
    (xy 5.304957 0.533599) (xy 5.326562 0.533439) (xy 5.408024 0.5334) (xy 5.414108 0.635335)) (layer F.SilkS) (width 0.01))
  (fp_poly (pts (xy 3.568263 -0.388205) (xy 3.570389 -0.378241) (xy 3.573267 -0.353566) (xy 3.576731 -0.316377)
    (xy 3.580614 -0.268872) (xy 3.584751 -0.213246) (xy 3.588976 -0.151698) (xy 3.593122 -0.086424)
    (xy 3.597023 -0.019622) (xy 3.599223 0.021167) (xy 3.601933 0.088635) (xy 3.603858 0.169736)
    (xy 3.605029 0.261735) (xy 3.60548 0.361896) (xy 3.605242 0.467484) (xy 3.604346 0.575764)
    (xy 3.602824 0.684) (xy 3.60071 0.789457) (xy 3.598033 0.8894) (xy 3.594827 0.981094)
    (xy 3.591123 1.061802) (xy 3.586953 1.12879) (xy 3.586188 1.138767) (xy 3.580266 1.209136)
    (xy 3.573314 1.284462) (xy 3.565548 1.362984) (xy 3.557181 1.442943) (xy 3.548427 1.522579)
    (xy 3.539501 1.60013) (xy 3.530616 1.673837) (xy 3.521988 1.74194) (xy 3.513829 1.802679)
    (xy 3.506355 1.854293) (xy 3.499779 1.895022) (xy 3.494316 1.923107) (xy 3.490179 1.936786)
    (xy 3.488966 1.937836) (xy 3.479581 1.936221) (xy 3.455827 1.93223) (xy 3.420043 1.926254)
    (xy 3.374567 1.918683) (xy 3.321737 1.909906) (xy 3.280273 1.903028) (xy 3.076513 1.869252)
    (xy 3.09163 1.766476) (xy 3.129619 1.472454) (xy 3.15816 1.17286) (xy 3.177133 0.871066)
    (xy 3.186417 0.570442) (xy 3.185888 0.274357) (xy 3.175427 -0.013819) (xy 3.162622 -0.202995)
    (xy 3.158818 -0.25096) (xy 3.155695 -0.292588) (xy 3.153442 -0.32515) (xy 3.15225 -0.345917)
    (xy 3.152218 -0.352261) (xy 3.161137 -0.353685) (xy 3.184056 -0.3562) (xy 3.218179 -0.359564)
    (xy 3.260711 -0.363537) (xy 3.308856 -0.367876) (xy 3.359819 -0.37234) (xy 3.410804 -0.376688)
    (xy 3.459016 -0.380678) (xy 3.50166 -0.384069) (xy 3.53594 -0.386619) (xy 3.559061 -0.388086)
    (xy 3.568227 -0.38823) (xy 3.568263 -0.388205)) (layer F.SilkS) (width 0.01))
  (fp_poly (pts (xy -4.316594 0.119905) (xy -4.250266 0.120715) (xy -4.172738 0.122052) (xy -4.109927 0.124072)
    (xy -4.059619 0.127253) (xy -4.019598 0.132074) (xy -3.987651 0.139015) (xy -3.961561 0.148553)
    (xy -3.939114 0.161168) (xy -3.918096 0.177337) (xy -3.896702 0.19714) (xy -3.87526 0.21975)
    (xy -3.858405 0.242553) (xy -3.84554 0.26799) (xy -3.836067 0.2985) (xy -3.829388 0.33652)
    (xy -3.824906 0.38449) (xy -3.822021 0.44485) (xy -3.820362 0.508551) (xy -3.819558 0.573937)
    (xy -3.81982 0.634135) (xy -3.821079 0.686066) (xy -3.823269 0.726649) (xy -3.825668 0.749032)
    (xy -3.842366 0.817074) (xy -3.869144 0.873221) (xy -3.905408 0.916337) (xy -3.918853 0.927148)
    (xy -3.94692 0.945449) (xy -3.976008 0.959344) (xy -4.00896 0.969384) (xy -4.048616 0.976121)
    (xy -4.097815 0.980106) (xy -4.159399 0.98189) (xy -4.202139 0.982134) (xy -4.351866 0.982134)
    (xy -4.351866 1.083335) (xy -4.352641 1.125516) (xy -4.354751 1.162791) (xy -4.357875 1.191005)
    (xy -4.361268 1.205172) (xy -4.380227 1.227731) (xy -4.410586 1.242599) (xy -4.448025 1.248382)
    (xy -4.483839 1.24475) (xy -4.498093 1.241566) (xy -4.510307 1.238118) (xy -4.52064 1.233159)
    (xy -4.529248 1.225442) (xy -4.536287 1.213721) (xy -4.541915 1.196749) (xy -4.546289 1.173279)
    (xy -4.549565 1.142065) (xy -4.5519 1.10186) (xy -4.553451 1.051417) (xy -4.554375 0.98949)
    (xy -4.55483 0.914832) (xy -4.554971 0.826196) (xy -4.554956 0.722335) (xy -4.554942 0.679722)
    (xy -4.554827 0.569707) (xy -4.554529 0.47557) (xy -4.554024 0.396257) (xy -4.553292 0.330714)
    (xy -4.553283 0.3302) (xy -4.351866 0.3302) (xy -4.351866 0.778934) (xy -4.224446 0.778934)
    (xy -4.169792 0.778475) (xy -4.12945 0.776951) (xy -4.100819 0.774145) (xy -4.081299 0.769838)
    (xy -4.072297 0.766146) (xy -4.05208 0.752163) (xy -4.038851 0.737069) (xy -4.035666 0.722529)
    (xy -4.033202 0.694353) (xy -4.031452 0.655825) (xy -4.030412 0.610225) (xy -4.030074 0.560836)
    (xy -4.030432 0.510941) (xy -4.031481 0.463822) (xy -4.033214 0.422761) (xy -4.035625 0.391041)
    (xy -4.038708 0.371943) (xy -4.039533 0.369633) (xy -4.047995 0.355697) (xy -4.060465 0.345409)
    (xy -4.079355 0.338244) (xy -4.107073 0.33368) (xy -4.146029 0.331192) (xy -4.198633 0.330258)
    (xy -4.221032 0.3302) (xy -4.351866 0.3302) (xy -4.553283 0.3302) (xy -4.55231 0.277887)
    (xy -4.551055 0.236722) (xy -4.549507 0.206164) (xy -4.547642 0.18516) (xy -4.545438 0.172654)
    (xy -4.544241 0.169334) (xy -4.529652 0.151341) (xy -4.507683 0.134861) (xy -4.504149 0.132927)
    (xy -4.493853 0.128312) (xy -4.481653 0.124788) (xy -4.465391 0.122252) (xy -4.442911 0.120599)
    (xy -4.412056 0.119726) (xy -4.370669 0.119529) (xy -4.316594 0.119905)) (layer F.SilkS) (width 0.01))
  (fp_poly (pts (xy 4.3697 -1.646574) (xy 4.375903 -1.622548) (xy 4.38441 -1.586567) (xy 4.394722 -1.540961)
    (xy 4.406338 -1.488055) (xy 4.418758 -1.430177) (xy 4.431482 -1.369655) (xy 4.444011 -1.308814)
    (xy 4.455844 -1.249983) (xy 4.466482 -1.195489) (xy 4.474534 -1.152545) (xy 4.530338 -0.808274)
    (xy 4.573293 -0.457985) (xy 4.603243 -0.104521) (xy 4.620033 0.249278) (xy 4.623508 0.600569)
    (xy 4.613512 0.946512) (xy 4.600741 1.153584) (xy 4.595216 1.227667) (xy 4.543391 1.226518)
    (xy 4.515758 1.22534) (xy 4.476033 1.222908) (xy 4.428985 1.219548) (xy 4.379382 1.215585)
    (xy 4.365883 1.214428) (xy 4.321725 1.210425) (xy 4.283979 1.206701) (xy 4.255656 1.203576)
    (xy 4.23977 1.201373) (xy 4.237454 1.200743) (xy 4.236996 1.191725) (xy 4.237837 1.169334)
    (xy 4.239803 1.137062) (xy 4.242348 1.102951) (xy 4.249498 0.995452) (xy 4.254932 0.874425)
    (xy 4.25865 0.743188) (xy 4.260654 0.60506) (xy 4.260946 0.463358) (xy 4.259526 0.321401)
    (xy 4.256395 0.182506) (xy 4.251555 0.049993) (xy 4.245007 -0.072821) (xy 4.241906 -0.118533)
    (xy 4.219275 -0.376218) (xy 4.188781 -0.637214) (xy 4.151094 -0.897083) (xy 4.106883 -1.151383)
    (xy 4.056815 -1.395676) (xy 4.035563 -1.488481) (xy 4.01519 -1.574683) (xy 4.045945 -1.58291)
    (xy 4.081757 -1.592189) (xy 4.124303 -1.602743) (xy 4.170675 -1.613903) (xy 4.217964 -1.625004)
    (xy 4.263259 -1.635379) (xy 4.303652 -1.644362) (xy 4.336234 -1.651285) (xy 4.358095 -1.655482)
    (xy 4.366302 -1.65632) (xy 4.3697 -1.646574)) (layer F.SilkS) (width 0.01))
  (fp_poly (pts (xy -3.549098 -0.135627) (xy -3.520698 -0.117545) (xy -3.50102 -0.089427) (xy -3.4973 -0.078757)
    (xy -3.493311 -0.055829) (xy -3.490228 -0.021831) (xy -3.488514 0.017382) (xy -3.488314 0.034783)
    (xy -3.488267 0.116133) (xy -3.33375 0.120762) (xy -3.269664 0.12316) (xy -3.219876 0.126205)
    (xy -3.181757 0.130158) (xy -3.152676 0.135276) (xy -3.13398 0.140441) (xy -3.08166 0.166051)
    (xy -3.035615 0.20433) (xy -2.999985 0.25141) (xy -2.987126 0.277642) (xy -2.982037 0.290713)
    (xy -2.97792 0.303359) (xy -2.974673 0.317464) (xy -2.972192 0.334914) (xy -2.970373 0.357593)
    (xy -2.969114 0.387386) (xy -2.968311 0.426177) (xy -2.967861 0.475852) (xy -2.96766 0.538295)
    (xy -2.967605 0.615392) (xy -2.967602 0.633607) (xy -2.967566 0.941247) (xy -2.991322 0.961691)
    (xy -3.009047 0.97393) (xy -3.029692 0.98015) (xy -3.059652 0.982101) (xy -3.066057 0.982134)
    (xy -3.096335 0.981116) (xy -3.11613 0.976669) (xy -3.131841 0.966701) (xy -3.141784 0.957385)
    (xy -3.166533 0.932636) (xy -3.166533 0.670782) (xy -3.166862 0.584433) (xy -3.167836 0.512417)
    (xy -3.169437 0.455315) (xy -3.171646 0.413709) (xy -3.174443 0.38818) (xy -3.175918 0.382007)
    (xy -3.184259 0.363877) (xy -3.196441 0.350449) (xy -3.214856 0.34105) (xy -3.241893 0.33501)
    (xy -3.279942 0.331658) (xy -3.331396 0.330323) (xy -3.360442 0.3302) (xy -3.487459 0.3302)
    (xy -3.48998 0.631471) (xy -3.4925 0.932742) (xy -3.52015 0.957438) (xy -3.540421 0.97282)
    (xy -3.560905 0.979979) (xy -3.589572 0.981587) (xy -3.592117 0.981561) (xy -3.621345 0.979576)
    (xy -3.645993 0.97517) (xy -3.654517 0.972231) (xy -3.662975 0.967885) (xy -3.670188 0.962803)
    (xy -3.676265 0.955684) (xy -3.68131 0.945223) (xy -3.68543 0.930119) (xy -3.688732 0.909069)
    (xy -3.691321 0.880768) (xy -3.693304 0.843915) (xy -3.694787 0.797206) (xy -3.695877 0.739339)
    (xy -3.696679 0.66901) (xy -3.697299 0.584917) (xy -3.697845 0.485757) (xy -3.698084 0.437932)
    (xy -3.698526 0.316425) (xy -3.698561 0.211615) (xy -3.698186 0.123273) (xy -3.697398 0.051169)
    (xy -3.696194 -0.004928) (xy -3.694571 -0.045248) (xy -3.692526 -0.070022) (xy -3.691304 -0.076804)
    (xy -3.675276 -0.108341) (xy -3.649309 -0.130029) (xy -3.617135 -0.141831) (xy -3.582488 -0.143709)
    (xy -3.549098 -0.135627)) (layer F.SilkS) (width 0.01))
  (fp_poly (pts (xy -2.29666 0.119369) (xy -2.251309 0.12056) (xy -2.216053 0.122719) (xy -2.189183 0.125997)
    (xy -2.168989 0.130545) (xy -2.153764 0.136513) (xy -2.141799 0.144052) (xy -2.131385 0.153313)
    (xy -2.131166 0.153531) (xy -2.117345 0.168797) (xy -2.110358 0.183054) (xy -2.108522 0.202392)
    (xy -2.109956 0.230219) (xy -2.113452 0.261502) (xy -2.119793 0.281711) (xy -2.131172 0.296693)
    (xy -2.136821 0.301844) (xy -2.143927 0.307676) (xy -2.151442 0.312239) (xy -2.161399 0.31569)
    (xy -2.175828 0.318183) (xy -2.196759 0.319874) (xy -2.226224 0.32092) (xy -2.266253 0.321474)
    (xy -2.318877 0.321694) (xy -2.386127 0.321734) (xy -2.633133 0.321734) (xy -2.633133 0.447765)
    (xy -2.284501 0.452967) (xy -2.264911 0.475761) (xy -2.247496 0.506143) (xy -2.239917 0.541877)
    (xy -2.241686 0.578375) (xy -2.252314 0.611046) (xy -2.271313 0.635299) (xy -2.282624 0.642317)
    (xy -2.300094 0.646092) (xy -2.333291 0.648981) (xy -2.381026 0.650923) (xy -2.442115 0.651856)
    (xy -2.468432 0.651934) (xy -2.633133 0.651934) (xy -2.633133 0.681169) (xy -2.630085 0.708724)
    (xy -2.623018 0.732604) (xy -2.615448 0.746608) (xy -2.60566 0.757486) (xy -2.591582 0.765629)
    (xy -2.571144 0.771425) (xy -2.542275 0.775264) (xy -2.502904 0.777535) (xy -2.450959 0.778628)
    (xy -2.384369 0.778932) (xy -2.376584 0.778934) (xy -2.308873 0.77938) (xy -2.251522 0.780669)
    (xy -2.206236 0.782727) (xy -2.174718 0.78548) (xy -2.160006 0.788318) (xy -2.132273 0.806461)
    (xy -2.115013 0.837829) (xy -2.108295 0.882285) (xy -2.1082 0.889231) (xy -2.109891 0.918104)
    (xy -2.116816 0.937871) (xy -2.131753 0.956181) (xy -2.132949 0.957385) (xy -2.157697 0.982134)
    (xy -2.389065 0.981267) (xy -2.451307 0.980815) (xy -2.5091 0.979979) (xy -2.559947 0.97883)
    (xy -2.60135 0.977436) (xy -2.630813 0.975866) (xy -2.645833 0.974189) (xy -2.70355 0.95163)
    (xy -2.75405 0.915005) (xy -2.794661 0.86656) (xy -2.812616 0.833967) (xy -2.817768 0.822282)
    (xy -2.821942 0.810665) (xy -2.825257 0.797231) (xy -2.827834 0.7801) (xy -2.829796 0.757386)
    (xy -2.831264 0.727209) (xy -2.832357 0.687684) (xy -2.833198 0.636929) (xy -2.833907 0.573061)
    (xy -2.834605 0.494196) (xy -2.834626 0.491693) (xy -2.835166 0.399187) (xy -2.835076 0.323025)
    (xy -2.834346 0.26263) (xy -2.832962 0.217426) (xy -2.830912 0.186834) (xy -2.828184 0.170278)
    (xy -2.827704 0.168942) (xy -2.821966 0.156845) (xy -2.81464 0.147066) (xy -2.803972 0.139333)
    (xy -2.788211 0.133378) (xy -2.765603 0.128931) (xy -2.734397 0.125721) (xy -2.692839 0.12348)
    (xy -2.639178 0.121938) (xy -2.571661 0.120824) (xy -2.510366 0.120102) (xy -2.42448 0.119291)
    (xy -2.353814 0.118996) (xy -2.29666 0.119369)) (layer F.SilkS) (width 0.01))
  (fp_poly (pts (xy -1.858863 -0.141035) (xy -1.82578 -0.131525) (xy -1.799538 -0.113743) (xy -1.78764 -0.09656)
    (xy -1.785202 -0.084817) (xy -1.783145 -0.0607) (xy -1.781456 -0.023532) (xy -1.78012 0.02736)
    (xy -1.779121 0.092654) (xy -1.778446 0.173022) (xy -1.77808 0.269142) (xy -1.778 0.351766)
    (xy -1.777989 0.447693) (xy -1.777918 0.528064) (xy -1.777732 0.594254) (xy -1.777375 0.64764)
    (xy -1.77679 0.689598) (xy -1.775923 0.721504) (xy -1.774716 0.744734) (xy -1.773114 0.760666)
    (xy -1.771062 0.770675) (xy -1.768502 0.776137) (xy -1.76538 0.77843) (xy -1.76164 0.778928)
    (xy -1.760646 0.778934) (xy -1.740826 0.782777) (xy -1.718638 0.791683) (xy -1.695824 0.812264)
    (xy -1.68227 0.842738) (xy -1.678335 0.878592) (xy -1.684379 0.915315) (xy -1.700762 0.948395)
    (xy -1.705659 0.954584) (xy -1.715096 0.96469) (xy -1.725073 0.971446) (xy -1.73913 0.975631)
    (xy -1.760806 0.978023) (xy -1.79364 0.9794) (xy -1.821698 0.980098) (xy -1.871032 0.980414)
    (xy -1.905929 0.978611) (xy -1.928777 0.974495) (xy -1.937935 0.970699) (xy -1.946647 0.96562)
    (xy -1.954084 0.960271) (xy -1.960349 0.953354) (xy -1.965542 0.943571) (xy -1.969766 0.929624)
    (xy -1.973122 0.910213) (xy -1.975711 0.884042) (xy -1.977635 0.84981) (xy -1.978997 0.806221)
    (xy -1.979896 0.751976) (xy -1.980436 0.685776) (xy -1.980717 0.606323) (xy -1.980842 0.512319)
    (xy -1.9809 0.421768) (xy -1.980824 0.318968) (xy -1.980477 0.22488) (xy -1.979878 0.140625)
    (xy -1.979042 0.067323) (xy -1.977986 0.006095) (xy -1.976728 -0.041937) (xy -1.975284 -0.075653)
    (xy -1.973672 -0.093933) (xy -1.973097 -0.096409) (xy -1.955903 -0.119958) (xy -1.928249 -0.135247)
    (xy -1.894461 -0.142274) (xy -1.858863 -0.141035)) (layer F.SilkS) (width 0.01))
  (fp_poly (pts (xy -0.949709 0.119977) (xy -0.873794 0.120429) (xy -0.806688 0.121251) (xy -0.750278 0.122419)
    (xy -0.706451 0.123908) (xy -0.677096 0.125693) (xy -0.671331 0.12629) (xy -0.600253 0.141107)
    (xy -0.541958 0.166904) (xy -0.495986 0.204108) (xy -0.461879 0.253146) (xy -0.439176 0.314443)
    (xy -0.432201 0.348303) (xy -0.42995 0.370679) (xy -0.427909 0.407276) (xy -0.426157 0.455383)
    (xy -0.424771 0.512289) (xy -0.42383 0.575282) (xy -0.423411 0.64165) (xy -0.423397 0.654322)
    (xy -0.423554 0.734313) (xy -0.424236 0.799097) (xy -0.425696 0.850397) (xy -0.428185 0.889939)
    (xy -0.431955 0.919446) (xy -0.437258 0.940643) (xy -0.444346 0.955253) (xy -0.45347 0.965)
    (xy -0.464882 0.971609) (xy -0.470041 0.973721) (xy -0.499983 0.980282) (xy -0.53604 0.981688)
    (xy -0.569858 0.978008) (xy -0.587101 0.972734) (xy -0.598351 0.966865) (xy -0.607497 0.959398)
    (xy -0.61479 0.948606) (xy -0.620482 0.932767) (xy -0.624824 0.910156) (xy -0.628068 0.879047)
    (xy -0.630465 0.837717) (xy -0.632268 0.784442) (xy -0.633728 0.717497) (xy -0.634945 0.644835)
    (xy -0.639233 0.371036) (xy -0.662989 0.350618) (xy -0.674225 0.341915) (xy -0.686234 0.336109)
    (xy -0.702571 0.332617) (xy -0.726795 0.330859) (xy -0.762462 0.330254) (xy -0.787872 0.3302)
    (xy -0.889 0.3302) (xy -0.889 0.932636) (xy -0.913749 0.957385) (xy -0.930841 0.972077)
    (xy -0.948477 0.979499) (xy -0.973517 0.981992) (xy -0.986272 0.982134) (xy -1.011641 0.981952)
    (xy -1.032376 0.980366) (xy -1.048974 0.97582) (xy -1.061928 0.966753) (xy -1.071736 0.951609)
    (xy -1.078893 0.928829) (xy -1.083893 0.896856) (xy -1.087234 0.85413) (xy -1.089409 0.799093)
    (xy -1.090916 0.730188) (xy -1.0922 0.649071) (xy -1.096433 0.371042) (xy -1.120189 0.350621)
    (xy -1.131425 0.341917) (xy -1.143431 0.33611) (xy -1.159766 0.332618) (xy -1.183985 0.33086)
    (xy -1.219647 0.330254) (xy -1.245072 0.3302) (xy -1.3462 0.3302) (xy -1.3462 0.616804)
    (xy -1.346501 0.708893) (xy -1.347397 0.785652) (xy -1.348879 0.846738) (xy -1.350936 0.891809)
    (xy -1.353557 0.920522) (xy -1.355584 0.930328) (xy -1.373727 0.95806) (xy -1.405095 0.975321)
    (xy -1.449551 0.982038) (xy -1.456497 0.982134) (xy -1.48537 0.980443) (xy -1.505137 0.973518)
    (xy -1.523447 0.958581) (xy -1.524651 0.957385) (xy -1.5494 0.932636) (xy -1.5494 0.178068)
    (xy -1.524701 0.150417) (xy -1.500003 0.122767) (xy -1.120418 0.120289) (xy -1.032546 0.119923)
    (xy -0.949709 0.119977)) (layer F.SilkS) (width 0.01))
  (fp_poly (pts (xy 0.193061 0.119909) (xy 0.194153 0.119928) (xy 0.259871 0.121367) (xy 0.310768 0.123505)
    (xy 0.348955 0.126961) (xy 0.376546 0.132356) (xy 0.395652 0.14031) (xy 0.408386 0.151442)
    (xy 0.416859 0.166373) (xy 0.423184 0.185723) (xy 0.423605 0.187276) (xy 0.426041 0.20564)
    (xy 0.42796 0.240373) (xy 0.429354 0.290917) (xy 0.430212 0.356716) (xy 0.430526 0.437213)
    (xy 0.430287 0.531851) (xy 0.430033 0.573703) (xy 0.429379 0.663631) (xy 0.428665 0.738165)
    (xy 0.427711 0.798842) (xy 0.426336 0.847201) (xy 0.424361 0.884779) (xy 0.421604 0.913116)
    (xy 0.417886 0.933748) (xy 0.413025 0.948215) (xy 0.406841 0.958055) (xy 0.399154 0.964805)
    (xy 0.389783 0.970003) (xy 0.383175 0.973065) (xy 0.355957 0.979929) (xy 0.32123 0.981772)
    (xy 0.287653 0.978594) (xy 0.268759 0.973065) (xy 0.251757 0.963025) (xy 0.23955 0.948972)
    (xy 0.231247 0.928079) (xy 0.225959 0.897522) (xy 0.222796 0.854478) (xy 0.221605 0.823384)
    (xy 0.218392 0.719667) (xy -0.09135 0.719667) (xy -0.094924 0.819151) (xy -0.097899 0.873112)
    (xy -0.102884 0.912733) (xy -0.110641 0.940561) (xy -0.121937 0.959144) (xy -0.137535 0.97103)
    (xy -0.141032 0.972734) (xy -0.169925 0.979954) (xy -0.206092 0.981265) (xy -0.241306 0.976912)
    (xy -0.264205 0.969022) (xy -0.285724 0.948197) (xy -0.295908 0.924911) (xy -0.298541 0.906552)
    (xy -0.300696 0.87396) (xy -0.302373 0.829829) (xy -0.303572 0.776851) (xy -0.304295 0.71772)
    (xy -0.304542 0.655131) (xy -0.304315 0.591775) (xy -0.303613 0.530348) (xy -0.302438 0.473541)
    (xy -0.301591 0.448083) (xy -0.093133 0.448083) (xy -0.093133 0.516467) (xy 0.220134 0.516467)
    (xy 0.220134 0.3302) (xy -0.043636 0.3302) (xy -0.068384 0.354949) (xy -0.080759 0.368504)
    (xy -0.088135 0.381785) (xy -0.091797 0.399623) (xy -0.093028 0.426845) (xy -0.093133 0.448083)
    (xy -0.301591 0.448083) (xy -0.30079 0.424049) (xy -0.298669 0.384566) (xy -0.296078 0.357784)
    (xy -0.295752 0.355651) (xy -0.279119 0.286659) (xy -0.253174 0.231218) (xy -0.216796 0.188268)
    (xy -0.168865 0.156749) (xy -0.108261 0.135598) (xy -0.053069 0.12581) (xy -0.021268 0.123158)
    (xy 0.023352 0.121144) (xy 0.076684 0.119866) (xy 0.134622 0.119422) (xy 0.193061 0.119909)) (layer F.SilkS) (width 0.01))
  (fp_poly (pts (xy -5.05199 -1.417175) (xy -5.022568 -1.415139) (xy -4.998804 -1.410372) (xy -4.975063 -1.401826)
    (xy -4.951719 -1.391288) (xy -4.917 -1.372164) (xy -4.882875 -1.348835) (xy -4.859867 -1.329266)
    (xy -4.832262 -1.295109) (xy -4.805777 -1.251129) (xy -4.784082 -1.204241) (xy -4.77092 -1.161709)
    (xy -4.765238 -1.133852) (xy -4.839774 -1.136309) (xy -4.914309 -1.138766) (xy -4.92271 -1.168132)
    (xy -4.93319 -1.189992) (xy -4.951771 -1.216639) (xy -4.969572 -1.237095) (xy -4.995357 -1.261167)
    (xy -5.018614 -1.275501) (xy -5.046534 -1.284227) (xy -5.0546 -1.285921) (xy -5.111522 -1.289739)
    (xy -5.162827 -1.278152) (xy -5.207001 -1.251809) (xy -5.242528 -1.211356) (xy -5.247291 -1.203646)
    (xy -5.254985 -1.190147) (xy -5.260797 -1.177647) (xy -5.265036 -1.16355) (xy -5.26801 -1.145259)
    (xy -5.270029 -1.120178) (xy -5.271401 -1.08571) (xy -5.272435 -1.039259) (xy -5.273339 -0.984667)
    (xy -5.274038 -0.911235) (xy -5.273272 -0.852451) (xy -5.270613 -0.806064) (xy -5.265635 -0.769822)
    (xy -5.25791 -0.741471) (xy -5.24701 -0.71876) (xy -5.232509 -0.699435) (xy -5.216133 -0.683176)
    (xy -5.170328 -0.652025) (xy -5.120619 -0.637155) (xy -5.068262 -0.638719) (xy -5.014512 -0.65687)
    (xy -5.011677 -0.658283) (xy -4.966721 -0.689156) (xy -4.935144 -0.729753) (xy -4.916593 -0.780705)
    (xy -4.910714 -0.840316) (xy -4.910667 -0.880533) (xy -5.1054 -0.880533) (xy -5.1054 -1.007533)
    (xy -4.766733 -1.007533) (xy -4.766733 -0.907488) (xy -4.768968 -0.82817) (xy -4.776221 -0.762654)
    (xy -4.78931 -0.708339) (xy -4.809056 -0.662621) (xy -4.836279 -0.622898) (xy -4.866256 -0.591582)
    (xy -4.912158 -0.555463) (xy -4.960605 -0.530947) (xy -5.015886 -0.516436) (xy -5.082289 -0.51033)
    (xy -5.084233 -0.510268) (xy -5.129579 -0.509747) (xy -5.163417 -0.511795) (xy -5.191054 -0.516974)
    (xy -5.212682 -0.523906) (xy -5.278638 -0.555447) (xy -5.331699 -0.597049) (xy -5.373663 -0.650352)
    (xy -5.395129 -0.690499) (xy -5.400948 -0.703798) (xy -5.405464 -0.716905) (xy -5.408841 -0.732093)
    (xy -5.411245 -0.751637) (xy -5.41284 -0.777812) (xy -5.413791 -0.812891) (xy -5.414263 -0.85915)
    (xy -5.41442 -0.918863) (xy -5.414433 -0.956733) (xy -5.414229 -1.034424) (xy -5.413281 -1.097403)
    (xy -5.411084 -1.147888) (xy -5.407134 -1.188099) (xy -5.400926 -1.220255) (xy -5.391955 -1.246575)
    (xy -5.379717 -1.269278) (xy -5.363707 -1.290583) (xy -5.343421 -1.31271) (xy -5.330518 -1.325774)
    (xy -5.287629 -1.363981) (xy -5.245228 -1.390563) (xy -5.198932 -1.407209) (xy -5.144361 -1.41561)
    (xy -5.0927 -1.417529) (xy -5.05199 -1.417175)) (layer F.SilkS) (width 0.01))
  (fp_poly (pts (xy -3.534043 -1.156709) (xy -3.489754 -1.148027) (xy -3.452238 -1.13211) (xy -3.42417 -1.113486)
    (xy -3.384014 -1.076054) (xy -3.353781 -1.031511) (xy -3.332373 -0.977412) (xy -3.318695 -0.911309)
    (xy -3.313972 -0.867765) (xy -3.308138 -0.795866) (xy -3.725333 -0.795866) (xy -3.725147 -0.772583)
    (xy -3.717316 -0.732558) (xy -3.696886 -0.693099) (xy -3.667527 -0.659466) (xy -3.632909 -0.636918)
    (xy -3.629532 -0.635563) (xy -3.592044 -0.627563) (xy -3.549148 -0.627916) (xy -3.506134 -0.635621)
    (xy -3.468293 -0.649674) (xy -3.440915 -0.669073) (xy -3.438546 -0.671758) (xy -3.42757 -0.681957)
    (xy -3.415836 -0.683624) (xy -3.400143 -0.67564) (xy -3.377294 -0.65689) (xy -3.365642 -0.646317)
    (xy -3.32345 -0.607507) (xy -3.352942 -0.582505) (xy -3.393668 -0.551582) (xy -3.433039 -0.530719)
    (xy -3.476242 -0.518081) (xy -3.528463 -0.51183) (xy -3.556 -0.51062) (xy -3.606441 -0.510313)
    (xy -3.64452 -0.512893) (xy -3.674623 -0.51875) (xy -3.685445 -0.522108) (xy -3.740895 -0.549716)
    (xy -3.786276 -0.590401) (xy -3.821165 -0.643324) (xy -3.845138 -0.707644) (xy -3.857771 -0.782523)
    (xy -3.858711 -0.865925) (xy -3.855879 -0.888999) (xy -3.725333 -0.888999) (xy -3.445611 -0.888999)
    (xy -3.450766 -0.912283) (xy -3.461519 -0.953311) (xy -3.473861 -0.982413) (xy -3.490227 -1.004576)
    (xy -3.500855 -1.014765) (xy -3.540511 -1.039121) (xy -3.58451 -1.048332) (xy -3.629304 -1.042236)
    (xy -3.668884 -1.02246) (xy -3.691727 -0.99863) (xy -3.711055 -0.965344) (xy -3.723053 -0.930076)
    (xy -3.725147 -0.912283) (xy -3.725333 -0.888999) (xy -3.855879 -0.888999) (xy -3.849386 -0.941879)
    (xy -3.830227 -1.005498) (xy -3.800548 -1.058694) (xy -3.78134 -1.082212) (xy -3.740407 -1.119331)
    (xy -3.69599 -1.143514) (xy -3.644186 -1.156338) (xy -3.589867 -1.159478) (xy -3.534043 -1.156709)) (layer F.SilkS) (width 0.01))
  (fp_poly (pts (xy -1.905857 -1.1592) (xy -1.878358 -1.156003) (xy -1.854288 -1.148847) (xy -1.826908 -1.136234)
    (xy -1.819341 -1.132356) (xy -1.772614 -1.102719) (xy -1.736629 -1.066759) (xy -1.710472 -1.022525)
    (xy -1.69323 -0.968061) (xy -1.683989 -0.901415) (xy -1.681743 -0.838199) (xy -1.685712 -0.755365)
    (xy -1.698404 -0.686229) (xy -1.720419 -0.629632) (xy -1.75236 -0.584413) (xy -1.794827 -0.549413)
    (xy -1.843934 -0.525154) (xy -1.881228 -0.515317) (xy -1.926877 -0.509635) (xy -1.973917 -0.508449)
    (xy -2.015387 -0.512102) (xy -2.032055 -0.51591) (xy -2.09102 -0.54108) (xy -2.138441 -0.577435)
    (xy -2.17453 -0.625383) (xy -2.199497 -0.685331) (xy -2.213554 -0.757688) (xy -2.216563 -0.833966)
    (xy -2.078567 -0.833966) (xy -2.077148 -0.776471) (xy -2.072162 -0.732858) (xy -2.062511 -0.700258)
    (xy -2.047101 -0.675802) (xy -2.024834 -0.65662) (xy -2.006729 -0.645919) (xy -1.970899 -0.630747)
    (xy -1.939938 -0.627662) (xy -1.907368 -0.636179) (xy -1.902611 -0.638142) (xy -1.871577 -0.655907)
    (xy -1.84864 -0.68051) (xy -1.832915 -0.714133) (xy -1.823512 -0.758963) (xy -1.819544 -0.817183)
    (xy -1.819277 -0.843168) (xy -1.822071 -0.904756) (xy -1.830774 -0.952337) (xy -1.846189 -0.98805)
    (xy -1.869117 -1.014034) (xy -1.888067 -1.026524) (xy -1.923387 -1.037586) (xy -1.963783 -1.038454)
    (xy -2.00194 -1.029554) (xy -2.022047 -1.018752) (xy -2.044546 -0.998353) (xy -2.060552 -0.973251)
    (xy -2.070958 -0.940519) (xy -2.07666 -0.897234) (xy -2.078552 -0.84047) (xy -2.078567 -0.833966)
    (xy -2.216563 -0.833966) (xy -2.216914 -0.842861) (xy -2.215901 -0.870349) (xy -2.21074 -0.932294)
    (xy -2.201657 -0.981429) (xy -2.187348 -1.02167) (xy -2.166513 -1.056935) (xy -2.145163 -1.083209)
    (xy -2.106746 -1.118269) (xy -2.063359 -1.141898) (xy -2.011683 -1.155359) (xy -1.948401 -1.159915)
    (xy -1.943522 -1.159933) (xy -1.905857 -1.1592)) (layer F.SilkS) (width 0.01))
  (fp_poly (pts (xy -1.251141 -1.261451) (xy -1.248833 -1.10897) (xy -1.216018 -1.132335) (xy -1.197083 -1.144281)
    (xy -1.177869 -1.15173) (xy -1.153085 -1.156012) (xy -1.117444 -1.158455) (xy -1.110918 -1.158742)
    (xy -1.055083 -1.158647) (xy -1.01143 -1.152366) (xy -0.976018 -1.138892) (xy -0.944905 -1.117217)
    (xy -0.943394 -1.115903) (xy -0.915436 -1.086544) (xy -0.894201 -1.052298) (xy -0.879119 -1.010912)
    (xy -0.869619 -0.96013) (xy -0.865129 -0.8977) (xy -0.865078 -0.821366) (xy -0.86543 -0.80816)
    (xy -0.869398 -0.734296) (xy -0.877087 -0.67495) (xy -0.889468 -0.62793) (xy -0.907511 -0.591046)
    (xy -0.932187 -0.562106) (xy -0.964466 -0.53892) (xy -0.9906 -0.525618) (xy -1.02719 -0.514628)
    (xy -1.072376 -0.508985) (xy -1.119531 -0.508832) (xy -1.162027 -0.514307) (xy -1.185273 -0.521487)
    (xy -1.210899 -0.535268) (xy -1.232882 -0.551277) (xy -1.233956 -0.552265) (xy -1.253067 -0.570218)
    (xy -1.253067 -0.516466) (xy -1.388533 -0.516466) (xy -1.388533 -0.831654) (xy -1.252145 -0.831654)
    (xy -1.249128 -0.778909) (xy -1.24121 -0.730861) (xy -1.228572 -0.691853) (xy -1.217308 -0.672617)
    (xy -1.185204 -0.644547) (xy -1.145986 -0.629906) (xy -1.103885 -0.629553) (xy -1.067095 -0.642125)
    (xy -1.043733 -0.657745) (xy -1.026597 -0.677641) (xy -1.014839 -0.704423) (xy -1.007609 -0.740699)
    (xy -1.00406 -0.789077) (xy -1.0033 -0.838199) (xy -1.00369 -0.887391) (xy -1.005099 -0.922974)
    (xy -1.00788 -0.948263) (xy -1.012388 -0.966569) (xy -1.018528 -0.980391) (xy -1.044602 -1.012823)
    (xy -1.078361 -1.033138) (xy -1.116202 -1.041435) (xy -1.154524 -1.03781) (xy -1.189725 -1.022361)
    (xy -1.218204 -0.995185) (xy -1.229971 -0.974662) (xy -1.242749 -0.933872) (xy -1.250079 -0.884755)
    (xy -1.252145 -0.831654) (xy -1.388533 -0.831654) (xy -1.388533 -1.413933) (xy -1.253448 -1.413933)
    (xy -1.251141 -1.261451)) (layer F.SilkS) (width 0.01))
  (fp_poly (pts (xy 0.199091 -1.15644) (xy 0.242678 -1.149838) (xy 0.276996 -1.139979) (xy 0.284014 -1.136763)
    (xy 0.334775 -1.101134) (xy 0.375322 -1.052552) (xy 0.405154 -0.991935) (xy 0.423771 -0.920199)
    (xy 0.429501 -0.869949) (xy 0.434307 -0.795866) (xy 0.22562 -0.795866) (xy 0.159204 -0.795934)
    (xy 0.107937 -0.795772) (xy 0.07004 -0.79483) (xy 0.04373 -0.792559) (xy 0.027228 -0.78841)
    (xy 0.018753 -0.781832) (xy 0.016524 -0.772278) (xy 0.018761 -0.759197) (xy 0.023682 -0.74204)
    (xy 0.025909 -0.734251) (xy 0.042812 -0.697335) (xy 0.069716 -0.664296) (xy 0.101793 -0.640501)
    (xy 0.115561 -0.634583) (xy 0.140862 -0.629665) (xy 0.174218 -0.627492) (xy 0.197708 -0.627984)
    (xy 0.234064 -0.632491) (xy 0.262912 -0.642586) (xy 0.290254 -0.65913) (xy 0.330701 -0.686957)
    (xy 0.37313 -0.651434) (xy 0.394387 -0.631923) (xy 0.408534 -0.615599) (xy 0.412459 -0.606405)
    (xy 0.402072 -0.592707) (xy 0.38072 -0.574718) (xy 0.35276 -0.555356) (xy 0.322551 -0.537538)
    (xy 0.29445 -0.524179) (xy 0.284213 -0.520567) (xy 0.254269 -0.514586) (xy 0.214499 -0.510658)
    (xy 0.17058 -0.508909) (xy 0.128193 -0.509466) (xy 0.093016 -0.512456) (xy 0.0762 -0.515917)
    (xy 0.016174 -0.542471) (xy -0.033338 -0.581798) (xy -0.071879 -0.633049) (xy -0.098993 -0.695373)
    (xy -0.114221 -0.767922) (xy -0.117108 -0.849844) (xy -0.115755 -0.872906) (xy -0.109588 -0.912151)
    (xy 0.017051 -0.912151) (xy 0.01913 -0.90122) (xy 0.028641 -0.894399) (xy 0.047641 -0.890726)
    (xy 0.078183 -0.889238) (xy 0.122321 -0.888972) (xy 0.157576 -0.888999) (xy 0.298218 -0.888999)
    (xy 0.292317 -0.920457) (xy 0.277378 -0.968113) (xy 0.251215 -1.005721) (xy 0.237122 -1.018887)
    (xy 0.199266 -1.040832) (xy 0.158215 -1.048219) (xy 0.117271 -1.042126) (xy 0.079736 -1.023633)
    (xy 0.048911 -0.99382) (xy 0.028099 -0.953766) (xy 0.026978 -0.950194) (xy 0.020352 -0.928155)
    (xy 0.017051 -0.912151) (xy -0.109588 -0.912151) (xy -0.103771 -0.949158) (xy -0.080821 -1.015599)
    (xy -0.047724 -1.071) (xy -0.0053 -1.114137) (xy 0.045629 -1.143782) (xy 0.071155 -1.152407)
    (xy 0.107486 -1.158154) (xy 0.152079 -1.159355) (xy 0.199091 -1.15644)) (layer F.SilkS) (width 0.01))
  (fp_poly (pts (xy -4.334933 -1.128987) (xy -4.334266 -1.109325) (xy -4.330699 -1.10386) (xy -4.321887 -1.109864)
    (xy -4.319964 -1.111588) (xy -4.284508 -1.134725) (xy -4.240141 -1.150395) (xy -4.19083 -1.158564)
    (xy -4.14054 -1.159197) (xy -4.093238 -1.152259) (xy -4.05289 -1.137718) (xy -4.023462 -1.115538)
    (xy -4.022295 -1.114164) (xy -4.017535 -1.105883) (xy -4.018927 -1.096541) (xy -4.028247 -1.083133)
    (xy -4.047272 -1.062653) (xy -4.060872 -1.04893) (xy -4.11152 -0.998282) (xy -4.135236 -1.016938)
    (xy -4.169841 -1.034617) (xy -4.209287 -1.040034) (xy -4.247471 -1.032901) (xy -4.26634 -1.023104)
    (xy -4.283591 -1.010473) (xy -4.297189 -0.997638) (xy -4.307567 -0.982488) (xy -4.315158 -0.962916)
    (xy -4.320395 -0.936812) (xy -4.323711 -0.902069) (xy -4.325539 -0.856577) (xy -4.326313 -0.798228)
    (xy -4.326466 -0.730382) (xy -4.326466 -0.516466) (xy -4.461933 -0.516466) (xy -4.461933 -1.159933)
    (xy -4.334933 -1.159933) (xy -4.334933 -1.128987)) (layer F.SilkS) (width 0.01))
  (fp_poly (pts (xy -2.8956 -1.128987) (xy -2.894932 -1.109325) (xy -2.891366 -1.10386) (xy -2.882554 -1.109864)
    (xy -2.880631 -1.111588) (xy -2.843268 -1.135536) (xy -2.795508 -1.151759) (xy -2.742314 -1.159663)
    (xy -2.688647 -1.158652) (xy -2.63947 -1.148132) (xy -2.624666 -1.142288) (xy -2.581494 -1.117814)
    (xy -2.549686 -1.086978) (xy -2.528593 -1.054099) (xy -2.523362 -1.043611) (xy -2.519207 -1.032402)
    (xy -2.515978 -1.018427) (xy -2.513528 -0.999637) (xy -2.511705 -0.973985) (xy -2.510362 -0.939424)
    (xy -2.50935 -0.893908) (xy -2.508518 -0.835387) (xy -2.507786 -0.768349) (xy -2.505205 -0.516466)
    (xy -2.6416 -0.516466) (xy -2.6416 -0.73333) (xy -2.641665 -0.799838) (xy -2.641969 -0.851651)
    (xy -2.642677 -0.891011) (xy -2.643954 -0.920156) (xy -2.645963 -0.941327) (xy -2.64887 -0.956761)
    (xy -2.652839 -0.9687) (xy -2.658034 -0.979382) (xy -2.65992 -0.98279) (xy -2.686647 -1.014888)
    (xy -2.72144 -1.03431) (xy -2.760904 -1.040846) (xy -2.801645 -1.034286) (xy -2.840269 -1.014422)
    (xy -2.861733 -0.995257) (xy -2.8829 -0.972331) (xy -2.885405 -0.744399) (xy -2.887911 -0.516466)
    (xy -3.031066 -0.516466) (xy -3.031066 -1.159933) (xy -2.8956 -1.159933) (xy -2.8956 -1.128987)) (layer F.SilkS) (width 0.01))
  (fp_poly (pts (xy -0.440266 -1.053828) (xy -0.440213 -0.959746) (xy -0.439936 -0.881161) (xy -0.439264 -0.816635)
    (xy -0.438021 -0.764733) (xy -0.436036 -0.724016) (xy -0.433134 -0.693047) (xy -0.429143 -0.670391)
    (xy -0.423888 -0.654611) (xy -0.417197 -0.644268) (xy -0.408895 -0.637927) (xy -0.39881 -0.634151)
    (xy -0.389362 -0.632015) (xy -0.361396 -0.627992) (xy -0.337608 -0.626533) (xy -0.324533 -0.625884)
    (xy -0.317252 -0.621382) (xy -0.314069 -0.609192) (xy -0.313287 -0.585479) (xy -0.313266 -0.571499)
    (xy -0.313266 -0.516466) (xy -0.383116 -0.517003) (xy -0.418655 -0.51826) (xy -0.449952 -0.521107)
    (xy -0.471302 -0.524985) (xy -0.474133 -0.525936) (xy -0.493526 -0.53713) (xy -0.516258 -0.554898)
    (xy -0.523049 -0.561151) (xy -0.534874 -0.573195) (xy -0.544786 -0.585537) (xy -0.552953 -0.599718)
    (xy -0.559544 -0.617277) (xy -0.564727 -0.639754) (xy -0.56867 -0.66869) (xy -0.571542 -0.705626)
    (xy -0.573512 -0.7521) (xy -0.574747 -0.809654) (xy -0.575417 -0.879827) (xy -0.575689 -0.964159)
    (xy -0.575733 -1.042936) (xy -0.575733 -1.413933) (xy -0.440266 -1.413933) (xy -0.440266 -1.053828)) (layer F.SilkS) (width 0.01))
  (fp_poly (pts (xy 1.363133 -0.516466) (xy 1.134533 -0.516466) (xy 1.134533 -1.413933) (xy 1.363133 -1.413933)
    (xy 1.363133 -0.516466)) (layer F.SilkS) (width 0.01))
  (fp_poly (pts (xy 2.129367 -0.989473) (xy 2.133891 -1.413933) (xy 2.3622 -1.413933) (xy 2.3622 -0.516466)
    (xy 2.161451 -0.516466) (xy 2.026876 -0.728219) (xy 1.8923 -0.939973) (xy 1.890038 -0.728219)
    (xy 1.887776 -0.516466) (xy 1.659467 -0.516466) (xy 1.659467 -1.413933) (xy 1.858459 -1.413933)
    (xy 2.129367 -0.989473)) (layer F.SilkS) (width 0.01))
  (fp_poly (pts (xy 3.113273 -1.4097) (xy 3.171221 -1.380066) (xy 3.230723 -1.341408) (xy 3.275961 -1.29364)
    (xy 3.306869 -1.236886) (xy 3.323378 -1.171267) (xy 3.325649 -1.100572) (xy 3.314014 -1.032689)
    (xy 3.287996 -0.971742) (xy 3.248661 -0.919816) (xy 3.2209 -0.895217) (xy 3.186566 -0.872178)
    (xy 3.150327 -0.855355) (xy 3.10849 -0.843733) (xy 3.057361 -0.836294) (xy 2.993248 -0.832022)
    (xy 2.99085 -0.831923) (xy 2.887133 -0.827689) (xy 2.887133 -0.516466) (xy 2.658533 -0.516466)
    (xy 2.658533 -1.032933) (xy 2.887133 -1.032933) (xy 2.944283 -1.03298) (xy 2.979388 -1.034339)
    (xy 3.012582 -1.037821) (xy 3.032798 -1.041738) (xy 3.067231 -1.058561) (xy 3.08936 -1.084389)
    (xy 3.098149 -1.11579) (xy 3.092567 -1.149333) (xy 3.074105 -1.178849) (xy 3.061951 -1.191676)
    (xy 3.050449 -1.19991) (xy 3.035441 -1.204753) (xy 3.012773 -1.207404) (xy 2.978288 -1.209066)
    (xy 2.968272 -1.209433) (xy 2.887133 -1.212367) (xy 2.887133 -1.032933) (xy 2.658533 -1.032933)
    (xy 2.658533 -1.415162) (xy 3.113273 -1.4097)) (layer F.SilkS) (width 0.01))
  (fp_poly (pts (xy 3.058078 -2.697379) (xy 3.058188 -2.697222) (xy 3.067133 -2.677565) (xy 3.07989 -2.643718)
    (xy 3.095908 -2.597551) (xy 3.114632 -2.540932) (xy 3.135509 -2.475734) (xy 3.157987 -2.403823)
    (xy 3.181511 -2.327072) (xy 3.205529 -2.247349) (xy 3.229486 -2.166523) (xy 3.252831 -2.086466)
    (xy 3.27501 -2.009046) (xy 3.295469 -1.936133) (xy 3.313656 -1.869597) (xy 3.329016 -1.811308)
    (xy 3.340997 -1.763135) (xy 3.349046 -1.726948) (xy 3.352608 -1.704617) (xy 3.352735 -1.7018)
    (xy 3.347942 -1.695353) (xy 3.33241 -1.687996) (xy 3.304471 -1.679166) (xy 3.262455 -1.668299)
    (xy 3.232138 -1.661111) (xy 3.180037 -1.648981) (xy 3.125182 -1.636142) (xy 3.073801 -1.624054)
    (xy 3.032122 -1.614179) (xy 3.029005 -1.613435) (xy 2.94651 -1.593749) (xy 2.938643 -1.624491)
    (xy 2.933545 -1.644547) (xy 2.925421 -1.676657) (xy 2.915374 -1.716455) (xy 2.904509 -1.759573)
    (xy 2.904133 -1.761066) (xy 2.866736 -1.902487) (xy 2.823423 -2.053766) (xy 2.775769 -2.209576)
    (xy 2.728981 -2.353733) (xy 2.710988 -2.407908) (xy 2.694858 -2.45706) (xy 2.681358 -2.498805)
    (xy 2.671255 -2.530759) (xy 2.665315 -2.550536) (xy 2.664058 -2.555651) (xy 2.67121 -2.562141)
    (xy 2.691834 -2.57276) (xy 2.72329 -2.58656) (xy 2.762936 -2.602593) (xy 2.808133 -2.619908)
    (xy 2.856238 -2.637559) (xy 2.904612 -2.654596) (xy 2.950613 -2.670071) (xy 2.991601 -2.683036)
    (xy 3.024935 -2.692541) (xy 3.047974 -2.697638) (xy 3.058078 -2.697379)) (layer F.SilkS) (width 0.01))
  (fp_poly (pts (xy 0.933808 -3.402492) (xy 0.953989 -3.377616) (xy 0.982046 -3.341546) (xy 1.016048 -3.296892)
    (xy 1.054061 -3.246263) (xy 1.094152 -3.192267) (xy 1.134389 -3.137513) (xy 1.172838 -3.08461)
    (xy 1.207566 -3.036167) (xy 1.236642 -2.994794) (xy 1.246625 -2.980266) (xy 1.416298 -2.717291)
    (xy 1.575377 -2.442448) (xy 1.705405 -2.192866) (xy 1.731706 -2.139089) (xy 1.759021 -2.082098)
    (xy 1.786423 -2.023943) (xy 1.812985 -1.966671) (xy 1.837782 -1.912332) (xy 1.859887 -1.862973)
    (xy 1.878374 -1.820644) (xy 1.892316 -1.787391) (xy 1.900787 -1.765265) (xy 1.90286 -1.756314)
    (xy 1.902833 -1.756286) (xy 1.894896 -1.752745) (xy 1.874155 -1.743957) (xy 1.843472 -1.731108)
    (xy 1.805709 -1.715381) (xy 1.763725 -1.697963) (xy 1.720384 -1.680037) (xy 1.678545 -1.662788)
    (xy 1.641071 -1.647401) (xy 1.610822 -1.635061) (xy 1.59066 -1.626951) (xy 1.587084 -1.625551)
    (xy 1.57982 -1.624199) (xy 1.572826 -1.627645) (xy 1.564773 -1.638049) (xy 1.554336 -1.65757)
    (xy 1.540188 -1.68837) (xy 1.521002 -1.732607) (xy 1.520231 -1.734405) (xy 1.413433 -1.967974)
    (xy 1.292626 -2.203633) (xy 1.159827 -2.437997) (xy 1.017051 -2.66768) (xy 0.866313 -2.889297)
    (xy 0.709629 -3.099463) (xy 0.700877 -3.110625) (xy 0.675871 -3.142953) (xy 0.655225 -3.170639)
    (xy 0.64095 -3.190915) (xy 0.635052 -3.201014) (xy 0.635 -3.201355) (xy 0.641289 -3.208527)
    (xy 0.658859 -3.224601) (xy 0.685769 -3.247904) (xy 0.720075 -3.276762) (xy 0.759836 -3.309503)
    (xy 0.77232 -3.319656) (xy 0.909639 -3.431017) (xy 0.933808 -3.402492)) (layer F.SilkS) (width 0.01))
  (fp_poly (pts (xy 2.357513 0.077201) (xy 2.360161 0.087518) (xy 2.363513 0.112357) (xy 2.367369 0.149329)
    (xy 2.371532 0.196048) (xy 2.375804 0.250125) (xy 2.379985 0.309173) (xy 2.383879 0.370805)
    (xy 2.387285 0.432631) (xy 2.387668 0.440267) (xy 2.395538 0.763549) (xy 2.387388 1.087794)
    (xy 2.36343 1.411725) (xy 2.323877 1.734067) (xy 2.268941 2.053543) (xy 2.198835 2.368877)
    (xy 2.11377 2.678793) (xy 2.01396 2.982016) (xy 1.926547 3.211727) (xy 1.89752 3.283598)
    (xy 1.87411 3.341336) (xy 1.855534 3.386485) (xy 1.84101 3.420588) (xy 1.829755 3.445191)
    (xy 1.820986 3.461838) (xy 1.813919 3.472072) (xy 1.807773 3.477438) (xy 1.801764 3.479479)
    (xy 1.79511 3.479741) (xy 1.7907 3.479685) (xy 1.774907 3.476255) (xy 1.746844 3.466729)
    (xy 1.70954 3.452273) (xy 1.666024 3.434052) (xy 1.626626 3.416571) (xy 1.581924 3.396098)
    (xy 1.542735 3.377916) (xy 1.511599 3.363223) (xy 1.491051 3.353213) (xy 1.483697 3.349186)
    (xy 1.485421 3.340389) (xy 1.49283 3.3186) (xy 1.504956 3.2864) (xy 1.520832 3.246367)
    (xy 1.536994 3.207049) (xy 1.571003 3.125042) (xy 1.599652 3.054573) (xy 1.624433 2.991696)
    (xy 1.646843 2.932464) (xy 1.668374 2.872932) (xy 1.69052 2.809153) (xy 1.713929 2.73972)
    (xy 1.805392 2.441364) (xy 1.881246 2.140767) (xy 1.941797 1.836333) (xy 1.987351 1.526466)
    (xy 2.018214 1.209572) (xy 2.024243 1.119732) (xy 2.027048 1.058679) (xy 2.028997 0.984518)
    (xy 2.030124 0.900302) (xy 2.030463 0.809087) (xy 2.030049 0.713927) (xy 2.028915 0.617877)
    (xy 2.027096 0.523991) (xy 2.024626 0.435325) (xy 2.021539 0.354934) (xy 2.01787 0.285872)
    (xy 2.014397 0.239243) (xy 2.010864 0.195875) (xy 2.008461 0.158778) (xy 2.007345 0.131084)
    (xy 2.007671 0.115928) (xy 2.0082 0.114112) (xy 2.017595 0.111876) (xy 2.040676 0.108445)
    (xy 2.07437 0.104142) (xy 2.115608 0.099292) (xy 2.161319 0.094221) (xy 2.208432 0.089251)
    (xy 2.253877 0.084708) (xy 2.294582 0.080915) (xy 2.327478 0.078199) (xy 2.349493 0.076882)
    (xy 2.357513 0.077201)) (layer F.Mask) (width 0.01))
)
