EESchema Schematic File Version 4
LIBS:TP_LigneDeTransmission_mesure-cache
EELAYER 30 0
EELAYER END
$Descr A4 11693 8268
encoding utf-8
Sheet 1 2
Title ""
Date ""
Rev ""
Comp ""
Comment1 ""
Comment2 ""
Comment3 ""
Comment4 ""
$EndDescr
Connection ~ 7900 5050
Wire Wire Line
	7900 5050 7900 5150
$Comp
L power:GND #PWR018
U 1 1 5C1A7B8D
P 7900 5050
F 0 "#PWR018" H 7900 4800 50  0001 C CNN
F 1 "GND" H 7900 4900 50  0000 C CNN
F 2 "" H 7900 5050 50  0001 C CNN
F 3 "" H 7900 5050 50  0001 C CNN
	1    7900 5050
	0    1    1    0   
$EndComp
$Comp
L Device:R R7
U 1 1 5C624C97
P 3200 6250
AR Path="/5C624C97" Ref="R7"  Part="1" 
AR Path="/5C1AEE01/5C624C97" Ref="R?"  Part="1" 
AR Path="/5C1AA865/5C1B8C06/5C624C97" Ref="R?"  Part="1" 
AR Path="/5C1AA865/5C1EBB42/5C624C97" Ref="R?"  Part="1" 
AR Path="/5C1AA865/5C1F1EC5/5C624C97" Ref="R?"  Part="1" 
AR Path="/5C1AA865/5C1F9233/5C624C97" Ref="R?"  Part="1" 
AR Path="/5C1AA865/5C200A3E/5C624C97" Ref="R?"  Part="1" 
AR Path="/5C1AA865/5C209418/5C624C97" Ref="R?"  Part="1" 
AR Path="/5C1AA865/5C2124D5/5C624C97" Ref="R?"  Part="1" 
AR Path="/5C1AA865/5C21C13B/5C624C97" Ref="R?"  Part="1" 
AR Path="/5C1AA865/5C226C26/5C624C97" Ref="R?"  Part="1" 
AR Path="/5C1AA865/5C2328D4/5C624C97" Ref="R?"  Part="1" 
AR Path="/5C1AA865/5C23F401/5C624C97" Ref="R?"  Part="1" 
AR Path="/5C1AA865/5C24C9A5/5C624C97" Ref="R?"  Part="1" 
AR Path="/5C1AA865/5C25C084/5C624C97" Ref="R?"  Part="1" 
AR Path="/5C1AA865/5C2FE807/5C624C97" Ref="R?"  Part="1" 
AR Path="/5C1AA865/5C30DB75/5C624C97" Ref="R?"  Part="1" 
AR Path="/5C1AA865/5C31CE81/5C624C97" Ref="R?"  Part="1" 
AR Path="/5C1AA865/5C32B921/5C624C97" Ref="R?"  Part="1" 
AR Path="/5C1AA865/5C33B55D/5C624C97" Ref="R?"  Part="1" 
AR Path="/5C1AA865/5C34ADC5/5C624C97" Ref="R?"  Part="1" 
AR Path="/5C1AA865/5C359865/5C624C97" Ref="R?"  Part="1" 
AR Path="/5C1AA865/5C3689E9/5C624C97" Ref="R?"  Part="1" 
AR Path="/5C1AA865/5C377B0B/5C624C97" Ref="R?"  Part="1" 
AR Path="/5C1AA865/5C3865AB/5C624C97" Ref="R?"  Part="1" 
AR Path="/5C1AA865/5C3957F3/5C624C97" Ref="R?"  Part="1" 
AR Path="/5C1AA865/5C3A4293/5C624C97" Ref="R?"  Part="1" 
AR Path="/5C1AA865/5C624C97" Ref="R?"  Part="1" 
AR Path="/5C1A74E1/5C624C97" Ref="R?"  Part="1" 
F 0 "R7" V 3100 6250 50  0000 C CNN
F 1 "2k7" V 3200 6250 50  0000 C CNN
F 2 "Resistor_SMD:R_1206_3216Metric_Pad1.42x1.75mm_HandSolder" V 3130 6250 50  0001 C CNN
F 3 "~" H 3200 6250 50  0001 C CNN
F 4 "Generic" H 3200 6250 50  0001 C CNN "Farnell"
	1    3200 6250
	-1   0    0    1   
$EndComp
$Comp
L power:GND #PWR026
U 1 1 5C624CA5
P 3200 7000
AR Path="/5C624CA5" Ref="#PWR026"  Part="1" 
AR Path="/5C1AEE01/5C624CA5" Ref="#PWR?"  Part="1" 
AR Path="/5C1AA865/5C1B8C06/5C624CA5" Ref="#PWR?"  Part="1" 
AR Path="/5C1AA865/5C1EBB42/5C624CA5" Ref="#PWR?"  Part="1" 
AR Path="/5C1AA865/5C1F1EC5/5C624CA5" Ref="#PWR?"  Part="1" 
AR Path="/5C1AA865/5C1F9233/5C624CA5" Ref="#PWR?"  Part="1" 
AR Path="/5C1AA865/5C200A3E/5C624CA5" Ref="#PWR?"  Part="1" 
AR Path="/5C1AA865/5C209418/5C624CA5" Ref="#PWR?"  Part="1" 
AR Path="/5C1AA865/5C2124D5/5C624CA5" Ref="#PWR?"  Part="1" 
AR Path="/5C1AA865/5C21C13B/5C624CA5" Ref="#PWR?"  Part="1" 
AR Path="/5C1AA865/5C226C26/5C624CA5" Ref="#PWR?"  Part="1" 
AR Path="/5C1AA865/5C2328D4/5C624CA5" Ref="#PWR?"  Part="1" 
AR Path="/5C1AA865/5C23F401/5C624CA5" Ref="#PWR?"  Part="1" 
AR Path="/5C1AA865/5C24C9A5/5C624CA5" Ref="#PWR?"  Part="1" 
AR Path="/5C1AA865/5C25C084/5C624CA5" Ref="#PWR?"  Part="1" 
AR Path="/5C1AA865/5C2FE807/5C624CA5" Ref="#PWR?"  Part="1" 
AR Path="/5C1AA865/5C30DB75/5C624CA5" Ref="#PWR?"  Part="1" 
AR Path="/5C1AA865/5C31CE81/5C624CA5" Ref="#PWR?"  Part="1" 
AR Path="/5C1AA865/5C32B921/5C624CA5" Ref="#PWR?"  Part="1" 
AR Path="/5C1AA865/5C33B55D/5C624CA5" Ref="#PWR?"  Part="1" 
AR Path="/5C1AA865/5C34ADC5/5C624CA5" Ref="#PWR?"  Part="1" 
AR Path="/5C1AA865/5C359865/5C624CA5" Ref="#PWR?"  Part="1" 
AR Path="/5C1AA865/5C3689E9/5C624CA5" Ref="#PWR?"  Part="1" 
AR Path="/5C1AA865/5C377B0B/5C624CA5" Ref="#PWR?"  Part="1" 
AR Path="/5C1AA865/5C3865AB/5C624CA5" Ref="#PWR?"  Part="1" 
AR Path="/5C1AA865/5C3957F3/5C624CA5" Ref="#PWR?"  Part="1" 
AR Path="/5C1AA865/5C3A4293/5C624CA5" Ref="#PWR?"  Part="1" 
AR Path="/5C1AA865/5C624CA5" Ref="#PWR?"  Part="1" 
AR Path="/5C1A74E1/5C624CA5" Ref="#PWR?"  Part="1" 
F 0 "#PWR026" H 3200 6750 50  0001 C CNN
F 1 "GND" H 3200 6850 50  0000 C CNN
F 2 "" H 3200 7000 50  0001 C CNN
F 3 "" H 3200 7000 50  0001 C CNN
	1    3200 7000
	1    0    0    -1  
$EndComp
$Comp
L Device:R R5
U 1 1 5C3F3229
P 4350 6000
AR Path="/5C3F3229" Ref="R5"  Part="1" 
AR Path="/5C1AEE01/5C3F3229" Ref="R?"  Part="1" 
AR Path="/5C1AA865/5C1B8C06/5C3F3229" Ref="R?"  Part="1" 
AR Path="/5C1AA865/5C1EBB42/5C3F3229" Ref="R?"  Part="1" 
AR Path="/5C1AA865/5C1F1EC5/5C3F3229" Ref="R?"  Part="1" 
AR Path="/5C1AA865/5C1F9233/5C3F3229" Ref="R?"  Part="1" 
AR Path="/5C1AA865/5C200A3E/5C3F3229" Ref="R?"  Part="1" 
AR Path="/5C1AA865/5C209418/5C3F3229" Ref="R?"  Part="1" 
AR Path="/5C1AA865/5C2124D5/5C3F3229" Ref="R?"  Part="1" 
AR Path="/5C1AA865/5C21C13B/5C3F3229" Ref="R?"  Part="1" 
AR Path="/5C1AA865/5C226C26/5C3F3229" Ref="R?"  Part="1" 
AR Path="/5C1AA865/5C2328D4/5C3F3229" Ref="R?"  Part="1" 
AR Path="/5C1AA865/5C23F401/5C3F3229" Ref="R?"  Part="1" 
AR Path="/5C1AA865/5C24C9A5/5C3F3229" Ref="R?"  Part="1" 
AR Path="/5C1AA865/5C25C084/5C3F3229" Ref="R?"  Part="1" 
AR Path="/5C1AA865/5C2FE807/5C3F3229" Ref="R?"  Part="1" 
AR Path="/5C1AA865/5C30DB75/5C3F3229" Ref="R?"  Part="1" 
AR Path="/5C1AA865/5C31CE81/5C3F3229" Ref="R?"  Part="1" 
AR Path="/5C1AA865/5C32B921/5C3F3229" Ref="R?"  Part="1" 
AR Path="/5C1AA865/5C33B55D/5C3F3229" Ref="R?"  Part="1" 
AR Path="/5C1AA865/5C34ADC5/5C3F3229" Ref="R?"  Part="1" 
AR Path="/5C1AA865/5C359865/5C3F3229" Ref="R?"  Part="1" 
AR Path="/5C1AA865/5C3689E9/5C3F3229" Ref="R?"  Part="1" 
AR Path="/5C1AA865/5C377B0B/5C3F3229" Ref="R?"  Part="1" 
AR Path="/5C1AA865/5C3865AB/5C3F3229" Ref="R?"  Part="1" 
AR Path="/5C1AA865/5C3957F3/5C3F3229" Ref="R?"  Part="1" 
AR Path="/5C1AA865/5C3A4293/5C3F3229" Ref="R?"  Part="1" 
AR Path="/5C1A74E1/5C3F3229" Ref="R?"  Part="1" 
AR Path="/5C1A74E1/5C36C53A/5C36DE5B/5C3F3229" Ref="R?"  Part="1" 
F 0 "R5" V 4250 6000 50  0000 C CNN
F 1 "10K" V 4350 6000 50  0000 C CNN
F 2 "Resistor_SMD:R_1206_3216Metric_Pad1.42x1.75mm_HandSolder" V 4280 6000 50  0001 C CNN
F 3 "~" H 4350 6000 50  0001 C CNN
F 4 "Generic" H 4350 6000 50  0001 C CNN "Farnell"
	1    4350 6000
	0    1    1    0   
$EndComp
Text Label 2000 4700 0    50   ~ 0
Out
$Comp
L Device:C C9
U 1 1 5C400F1A
P 3500 6750
F 0 "C9" H 3500 6850 50  0000 L CNN
F 1 "10n" H 3500 6600 50  0000 L CNN
F 2 "Capacitor_SMD:C_1206_3216Metric_Pad1.42x1.75mm_HandSolder" H 3538 6600 50  0001 C CNN
F 3 "~" H 3500 6750 50  0001 C CNN
F 4 "2896636" H -1350 -50 50  0001 C CNN "Farnell"
F 5 "0,0745" H -1350 -50 50  0001 C CNN "Prix Unit"
F 6 "VJ1206Y103KXACW1BC" H -1350 -50 50  0001 C CNN "Ref Fabricant"
	1    3500 6750
	-1   0    0    -1  
$EndComp
$Comp
L power:+5V #PWR023
U 1 1 5C4020E0
P 3200 6000
F 0 "#PWR023" H 3200 5850 50  0001 C CNN
F 1 "+5V" H 3200 6150 50  0000 C CNN
F 2 "" H 3200 6000 50  0001 C CNN
F 3 "" H 3200 6000 50  0001 C CNN
	1    3200 6000
	1    0    0    -1  
$EndComp
Text Label 7900 4650 2    50   ~ 0
Shifted_measure
Text Label 10500 3650 0    50   ~ 0
Sample_Holder
Text Label 2000 4500 0    50   ~ 0
S_D
Text Label 2000 4400 0    50   ~ 0
S_C
Text Label 2000 4300 0    50   ~ 0
S_B
Text Label 2000 4200 0    50   ~ 0
S_A
Text Label 2000 4000 0    50   ~ 0
S_2
Text Label 2000 3900 0    50   ~ 0
S_1
Text Label 2000 3800 0    50   ~ 0
S_0
$Sheet
S 1000 3500 1000 1300
U 5DC66300
F0 "analog_demux" 50
F1 "analog_demux.sch" 50
F2 "S_A" I R 2000 4200 50 
F3 "S_B" I R 2000 4300 50 
F4 "S_C" I R 2000 4400 50 
F5 "S_D" I R 2000 4500 50 
F6 "S_0" I R 2000 3800 50 
F7 "S_1" I R 2000 3900 50 
F8 "S_2" I R 2000 4000 50 
F9 "Out" I R 2000 4700 50 
F10 "~S~|H" I R 2000 3600 50 
$EndSheet
Wire Wire Line
	3500 6500 3500 6600
Wire Wire Line
	3500 6900 3500 7000
Wire Wire Line
	3500 7000 3200 7000
Text Label 7900 4750 2    50   ~ 0
Vref_shift
Wire Wire Line
	3200 6100 3200 6000
$Comp
L Device:R R1
U 1 1 5DD50D61
P 4350 6200
AR Path="/5DD50D61" Ref="R1"  Part="1" 
AR Path="/5C1AEE01/5DD50D61" Ref="R?"  Part="1" 
AR Path="/5C1AA865/5C1B8C06/5DD50D61" Ref="R?"  Part="1" 
AR Path="/5C1AA865/5C1EBB42/5DD50D61" Ref="R?"  Part="1" 
AR Path="/5C1AA865/5C1F1EC5/5DD50D61" Ref="R?"  Part="1" 
AR Path="/5C1AA865/5C1F9233/5DD50D61" Ref="R?"  Part="1" 
AR Path="/5C1AA865/5C200A3E/5DD50D61" Ref="R?"  Part="1" 
AR Path="/5C1AA865/5C209418/5DD50D61" Ref="R?"  Part="1" 
AR Path="/5C1AA865/5C2124D5/5DD50D61" Ref="R?"  Part="1" 
AR Path="/5C1AA865/5C21C13B/5DD50D61" Ref="R?"  Part="1" 
AR Path="/5C1AA865/5C226C26/5DD50D61" Ref="R?"  Part="1" 
AR Path="/5C1AA865/5C2328D4/5DD50D61" Ref="R?"  Part="1" 
AR Path="/5C1AA865/5C23F401/5DD50D61" Ref="R?"  Part="1" 
AR Path="/5C1AA865/5C24C9A5/5DD50D61" Ref="R?"  Part="1" 
AR Path="/5C1AA865/5C25C084/5DD50D61" Ref="R?"  Part="1" 
AR Path="/5C1AA865/5C2FE807/5DD50D61" Ref="R?"  Part="1" 
AR Path="/5C1AA865/5C30DB75/5DD50D61" Ref="R?"  Part="1" 
AR Path="/5C1AA865/5C31CE81/5DD50D61" Ref="R?"  Part="1" 
AR Path="/5C1AA865/5C32B921/5DD50D61" Ref="R?"  Part="1" 
AR Path="/5C1AA865/5C33B55D/5DD50D61" Ref="R?"  Part="1" 
AR Path="/5C1AA865/5C34ADC5/5DD50D61" Ref="R?"  Part="1" 
AR Path="/5C1AA865/5C359865/5DD50D61" Ref="R?"  Part="1" 
AR Path="/5C1AA865/5C3689E9/5DD50D61" Ref="R?"  Part="1" 
AR Path="/5C1AA865/5C377B0B/5DD50D61" Ref="R?"  Part="1" 
AR Path="/5C1AA865/5C3865AB/5DD50D61" Ref="R?"  Part="1" 
AR Path="/5C1AA865/5C3957F3/5DD50D61" Ref="R?"  Part="1" 
AR Path="/5C1AA865/5C3A4293/5DD50D61" Ref="R?"  Part="1" 
AR Path="/5C1A74E1/5DD50D61" Ref="R?"  Part="1" 
AR Path="/5C1A74E1/5C36C53A/5C36DE5B/5DD50D61" Ref="R?"  Part="1" 
F 0 "R1" V 4250 6200 50  0000 C CNN
F 1 "10K" V 4350 6200 50  0000 C CNN
F 2 "Resistor_SMD:R_1206_3216Metric_Pad1.42x1.75mm_HandSolder" V 4280 6200 50  0001 C CNN
F 3 "~" H 4350 6200 50  0001 C CNN
F 4 "Generic" H 4350 6200 50  0001 C CNN "Farnell"
	1    4350 6200
	0    1    1    0   
$EndComp
Text Label 4200 6200 2    50   ~ 0
Vref_shift
Text Label 4200 6000 2    50   ~ 0
Out
Wire Wire Line
	4500 6000 4600 6000
Wire Wire Line
	4600 6000 4600 6100
Wire Wire Line
	4600 6200 4500 6200
Connection ~ 4600 6100
Wire Wire Line
	4600 6100 4600 6200
$Comp
L Device:R R3
U 1 1 5DD52ABF
P 5400 6450
AR Path="/5DD52ABF" Ref="R3"  Part="1" 
AR Path="/5C1AEE01/5DD52ABF" Ref="R?"  Part="1" 
AR Path="/5C1AA865/5C1B8C06/5DD52ABF" Ref="R?"  Part="1" 
AR Path="/5C1AA865/5C1EBB42/5DD52ABF" Ref="R?"  Part="1" 
AR Path="/5C1AA865/5C1F1EC5/5DD52ABF" Ref="R?"  Part="1" 
AR Path="/5C1AA865/5C1F9233/5DD52ABF" Ref="R?"  Part="1" 
AR Path="/5C1AA865/5C200A3E/5DD52ABF" Ref="R?"  Part="1" 
AR Path="/5C1AA865/5C209418/5DD52ABF" Ref="R?"  Part="1" 
AR Path="/5C1AA865/5C2124D5/5DD52ABF" Ref="R?"  Part="1" 
AR Path="/5C1AA865/5C21C13B/5DD52ABF" Ref="R?"  Part="1" 
AR Path="/5C1AA865/5C226C26/5DD52ABF" Ref="R?"  Part="1" 
AR Path="/5C1AA865/5C2328D4/5DD52ABF" Ref="R?"  Part="1" 
AR Path="/5C1AA865/5C23F401/5DD52ABF" Ref="R?"  Part="1" 
AR Path="/5C1AA865/5C24C9A5/5DD52ABF" Ref="R?"  Part="1" 
AR Path="/5C1AA865/5C25C084/5DD52ABF" Ref="R?"  Part="1" 
AR Path="/5C1AA865/5C2FE807/5DD52ABF" Ref="R?"  Part="1" 
AR Path="/5C1AA865/5C30DB75/5DD52ABF" Ref="R?"  Part="1" 
AR Path="/5C1AA865/5C31CE81/5DD52ABF" Ref="R?"  Part="1" 
AR Path="/5C1AA865/5C32B921/5DD52ABF" Ref="R?"  Part="1" 
AR Path="/5C1AA865/5C33B55D/5DD52ABF" Ref="R?"  Part="1" 
AR Path="/5C1AA865/5C34ADC5/5DD52ABF" Ref="R?"  Part="1" 
AR Path="/5C1AA865/5C359865/5DD52ABF" Ref="R?"  Part="1" 
AR Path="/5C1AA865/5C3689E9/5DD52ABF" Ref="R?"  Part="1" 
AR Path="/5C1AA865/5C377B0B/5DD52ABF" Ref="R?"  Part="1" 
AR Path="/5C1AA865/5C3865AB/5DD52ABF" Ref="R?"  Part="1" 
AR Path="/5C1AA865/5C3957F3/5DD52ABF" Ref="R?"  Part="1" 
AR Path="/5C1AA865/5C3A4293/5DD52ABF" Ref="R?"  Part="1" 
AR Path="/5C1A74E1/5DD52ABF" Ref="R?"  Part="1" 
AR Path="/5C1A74E1/5C36C53A/5C36DE5B/5DD52ABF" Ref="R?"  Part="1" 
F 0 "R3" V 5300 6450 50  0000 C CNN
F 1 "10K" V 5400 6450 50  0000 C CNN
F 2 "Resistor_SMD:R_1206_3216Metric_Pad1.42x1.75mm_HandSolder" V 5330 6450 50  0001 C CNN
F 3 "~" H 5400 6450 50  0001 C CNN
F 4 "Generic" H 5400 6450 50  0001 C CNN "Farnell"
	1    5400 6450
	-1   0    0    1   
$EndComp
$Comp
L Device:R R4
U 1 1 5DD56F97
P 5400 6750
AR Path="/5DD56F97" Ref="R4"  Part="1" 
AR Path="/5C1AEE01/5DD56F97" Ref="R?"  Part="1" 
AR Path="/5C1AA865/5C1B8C06/5DD56F97" Ref="R?"  Part="1" 
AR Path="/5C1AA865/5C1EBB42/5DD56F97" Ref="R?"  Part="1" 
AR Path="/5C1AA865/5C1F1EC5/5DD56F97" Ref="R?"  Part="1" 
AR Path="/5C1AA865/5C1F9233/5DD56F97" Ref="R?"  Part="1" 
AR Path="/5C1AA865/5C200A3E/5DD56F97" Ref="R?"  Part="1" 
AR Path="/5C1AA865/5C209418/5DD56F97" Ref="R?"  Part="1" 
AR Path="/5C1AA865/5C2124D5/5DD56F97" Ref="R?"  Part="1" 
AR Path="/5C1AA865/5C21C13B/5DD56F97" Ref="R?"  Part="1" 
AR Path="/5C1AA865/5C226C26/5DD56F97" Ref="R?"  Part="1" 
AR Path="/5C1AA865/5C2328D4/5DD56F97" Ref="R?"  Part="1" 
AR Path="/5C1AA865/5C23F401/5DD56F97" Ref="R?"  Part="1" 
AR Path="/5C1AA865/5C24C9A5/5DD56F97" Ref="R?"  Part="1" 
AR Path="/5C1AA865/5C25C084/5DD56F97" Ref="R?"  Part="1" 
AR Path="/5C1AA865/5C2FE807/5DD56F97" Ref="R?"  Part="1" 
AR Path="/5C1AA865/5C30DB75/5DD56F97" Ref="R?"  Part="1" 
AR Path="/5C1AA865/5C31CE81/5DD56F97" Ref="R?"  Part="1" 
AR Path="/5C1AA865/5C32B921/5DD56F97" Ref="R?"  Part="1" 
AR Path="/5C1AA865/5C33B55D/5DD56F97" Ref="R?"  Part="1" 
AR Path="/5C1AA865/5C34ADC5/5DD56F97" Ref="R?"  Part="1" 
AR Path="/5C1AA865/5C359865/5DD56F97" Ref="R?"  Part="1" 
AR Path="/5C1AA865/5C3689E9/5DD56F97" Ref="R?"  Part="1" 
AR Path="/5C1AA865/5C377B0B/5DD56F97" Ref="R?"  Part="1" 
AR Path="/5C1AA865/5C3865AB/5DD56F97" Ref="R?"  Part="1" 
AR Path="/5C1AA865/5C3957F3/5DD56F97" Ref="R?"  Part="1" 
AR Path="/5C1AA865/5C3A4293/5DD56F97" Ref="R?"  Part="1" 
AR Path="/5C1A74E1/5DD56F97" Ref="R?"  Part="1" 
AR Path="/5C1A74E1/5C36C53A/5C36DE5B/5DD56F97" Ref="R?"  Part="1" 
F 0 "R4" V 5300 6750 50  0000 C CNN
F 1 "10K" V 5400 6750 50  0000 C CNN
F 2 "Resistor_SMD:R_1206_3216Metric_Pad1.42x1.75mm_HandSolder" V 5330 6750 50  0001 C CNN
F 3 "~" H 5400 6750 50  0001 C CNN
F 4 "Generic" H 5400 6750 50  0001 C CNN "Farnell"
	1    5400 6750
	-1   0    0    1   
$EndComp
Wire Wire Line
	5400 6600 4600 6600
Connection ~ 5400 6600
Wire Wire Line
	5300 6200 5400 6200
Wire Wire Line
	5400 6200 5400 6300
Connection ~ 5400 6200
Wire Wire Line
	5400 6200 5500 6200
$Comp
L power:GND #PWR0101
U 1 1 5DD5FFB9
P 5400 6900
AR Path="/5DD5FFB9" Ref="#PWR0101"  Part="1" 
AR Path="/5C1AEE01/5DD5FFB9" Ref="#PWR?"  Part="1" 
AR Path="/5C1AA865/5C1B8C06/5DD5FFB9" Ref="#PWR?"  Part="1" 
AR Path="/5C1AA865/5C1EBB42/5DD5FFB9" Ref="#PWR?"  Part="1" 
AR Path="/5C1AA865/5C1F1EC5/5DD5FFB9" Ref="#PWR?"  Part="1" 
AR Path="/5C1AA865/5C1F9233/5DD5FFB9" Ref="#PWR?"  Part="1" 
AR Path="/5C1AA865/5C200A3E/5DD5FFB9" Ref="#PWR?"  Part="1" 
AR Path="/5C1AA865/5C209418/5DD5FFB9" Ref="#PWR?"  Part="1" 
AR Path="/5C1AA865/5C2124D5/5DD5FFB9" Ref="#PWR?"  Part="1" 
AR Path="/5C1AA865/5C21C13B/5DD5FFB9" Ref="#PWR?"  Part="1" 
AR Path="/5C1AA865/5C226C26/5DD5FFB9" Ref="#PWR?"  Part="1" 
AR Path="/5C1AA865/5C2328D4/5DD5FFB9" Ref="#PWR?"  Part="1" 
AR Path="/5C1AA865/5C23F401/5DD5FFB9" Ref="#PWR?"  Part="1" 
AR Path="/5C1AA865/5C24C9A5/5DD5FFB9" Ref="#PWR?"  Part="1" 
AR Path="/5C1AA865/5C25C084/5DD5FFB9" Ref="#PWR?"  Part="1" 
AR Path="/5C1AA865/5C2FE807/5DD5FFB9" Ref="#PWR?"  Part="1" 
AR Path="/5C1AA865/5C30DB75/5DD5FFB9" Ref="#PWR?"  Part="1" 
AR Path="/5C1AA865/5C31CE81/5DD5FFB9" Ref="#PWR?"  Part="1" 
AR Path="/5C1AA865/5C32B921/5DD5FFB9" Ref="#PWR?"  Part="1" 
AR Path="/5C1AA865/5C33B55D/5DD5FFB9" Ref="#PWR?"  Part="1" 
AR Path="/5C1AA865/5C34ADC5/5DD5FFB9" Ref="#PWR?"  Part="1" 
AR Path="/5C1AA865/5C359865/5DD5FFB9" Ref="#PWR?"  Part="1" 
AR Path="/5C1AA865/5C3689E9/5DD5FFB9" Ref="#PWR?"  Part="1" 
AR Path="/5C1AA865/5C377B0B/5DD5FFB9" Ref="#PWR?"  Part="1" 
AR Path="/5C1AA865/5C3865AB/5DD5FFB9" Ref="#PWR?"  Part="1" 
AR Path="/5C1AA865/5C3957F3/5DD5FFB9" Ref="#PWR?"  Part="1" 
AR Path="/5C1AA865/5C3A4293/5DD5FFB9" Ref="#PWR?"  Part="1" 
AR Path="/5C1A74E1/5DD5FFB9" Ref="#PWR?"  Part="1" 
AR Path="/5C1A74E1/5C36C53A/5C36DE5B/5DD5FFB9" Ref="#PWR?"  Part="1" 
F 0 "#PWR0101" H 5400 6650 50  0001 C CNN
F 1 "GND" H 5400 6750 50  0000 C CNN
F 2 "" H 5400 6900 50  0001 C CNN
F 3 "" H 5400 6900 50  0001 C CNN
	1    5400 6900
	1    0    0    -1  
$EndComp
$Comp
L Reference_Voltage:LM4040DBZ-2.5 U6
U 1 1 5DD73C1E
P 3200 6750
F 0 "U6" V 3300 6750 50  0000 R CNN
F 1 "LM4040DBZ-2.5" H 3200 6900 50  0000 C CNN
F 2 "Package_TO_SOT_SMD:SOT-23" H 3200 6550 50  0001 C CIN
F 3 "http://www.ti.com/lit/ds/symlink/lm4040-n.pdf" H 3200 6750 50  0001 C CIN
F 4 "3124419" H 3200 6750 50  0001 C CNN "Farnell"
F 5 "1,28" H 3200 6750 50  0001 C CNN "Prix Unit"
	1    3200 6750
	0    -1   -1   0   
$EndComp
Wire Wire Line
	3200 7000 3200 6900
Wire Wire Line
	3200 6400 3200 6500
Connection ~ 3200 6500
Wire Wire Line
	3200 6500 3200 6600
Text Label 3300 6500 0    50   ~ 0
Vref_shift
Connection ~ 3200 7000
Wire Wire Line
	3200 6500 3500 6500
Text Label 2000 3600 0    50   ~ 0
Sample_Holder
Text Label 5500 6200 0    50   ~ 0
Shifted_measure
$Comp
L arduino:Arduino_Micro_Socket A1
U 1 1 5DC498E2
P 9200 4550
F 0 "A1" H 9200 5787 60  0000 C CNN
F 1 "Arduino_Micro_Socket" H 9200 5681 60  0000 C CNN
F 2 "Arduino:Arduino_Micro_Socket" H 11000 8300 60  0001 C CNN
F 3 "https://store.arduino.cc/arduino-micro" H 11000 8300 60  0001 C CNN
	1    9200 4550
	1    0    0    -1  
$EndComp
NoConn ~ 10500 4450
NoConn ~ 10500 4550
NoConn ~ 10500 4750
NoConn ~ 10500 4850
NoConn ~ 10500 4950
NoConn ~ 10500 5050
NoConn ~ 10500 5250
NoConn ~ 10500 5350
NoConn ~ 7900 3650
NoConn ~ 7900 3750
NoConn ~ 7900 3950
NoConn ~ 7900 4050
NoConn ~ 7900 4250
NoConn ~ 7900 4350
NoConn ~ 7900 4450
NoConn ~ 7900 4550
NoConn ~ 7900 4850
Text Label 10500 3950 0    50   ~ 0
S_2
Text Label 10500 3850 0    50   ~ 0
S_1
Text Label 10500 3750 0    50   ~ 0
S_0
Text Label 10500 4050 0    50   ~ 0
S_D
Text Label 10500 4150 0    50   ~ 0
S_C
Text Label 10500 4250 0    50   ~ 0
S_B
Text Label 10500 4350 0    50   ~ 0
S_A
$Comp
L Graphic:Logo_Open_Hardware_Small LOGO2
U 1 1 5DCECD46
P 1000 7500
F 0 "LOGO2" H 1000 7775 50  0001 C CNN
F 1 "Logo_Open_Hardware_Small" H 1000 7275 50  0001 C CNN
F 2 "Symbol:OSHW-Logo_7.5x8mm_SilkScreen" H 1000 7500 50  0001 C CNN
F 3 "~" H 1000 7500 50  0001 C CNN
F 4 "/" H 1000 7500 50  0001 C CNN "Farnell"
	1    1000 7500
	1    0    0    -1  
$EndComp
$Comp
L Graphic:Logo_Open_Hardware_Small LOGO1
U 1 1 5DCED2F1
P 1000 7000
F 0 "LOGO1" H 1000 7275 50  0001 C CNN
F 1 "Logo_Open_Hardware_Small" H 1000 6775 50  0001 C CNN
F 2 "logos:logo_phelma_32x21mm" H 1000 7000 50  0001 C CNN
F 3 "~" H 1000 7000 50  0001 C CNN
F 4 "/" H 1000 7000 50  0001 C CNN "Farnell"
	1    1000 7000
	1    0    0    -1  
$EndComp
$Comp
L Graphic:Logo_Open_Hardware_Small LOGO3
U 1 1 5DCED478
P 1500 7500
F 0 "LOGO3" H 1500 7775 50  0001 C CNN
F 1 "Logo_Open_Hardware_Small" H 1500 7275 50  0001 C CNN
F 2 "Symbol:KiCad-Logo2_5mm_SilkScreen" H 1500 7500 50  0001 C CNN
F 3 "~" H 1500 7500 50  0001 C CNN
F 4 "/" H 1500 7500 50  0001 C CNN "Farnell"
	1    1500 7500
	1    0    0    -1  
$EndComp
$Comp
L Device:C C1
U 1 1 5DD4B2F3
P 3600 2150
F 0 "C1" H 3600 2250 50  0000 R CNN
F 1 "330n" H 3600 2050 50  0000 R CNN
F 2 "Capacitor_SMD:C_0805_2012Metric_Pad1.15x1.40mm_HandSolder" H 3638 2000 50  0001 C CNN
F 3 "~" H 3600 2150 50  0001 C CNN
F 4 "2991367" H 3600 2150 50  0001 C CNN "Farnell"
F 5 "0,171" H 3600 2150 50  0001 C CNN "Prix Unit"
	1    3600 2150
	1    0    0    -1  
$EndComp
$Comp
L Device:C C2
U 1 1 5DD4F3B0
P 4400 2150
F 0 "C2" H 4400 2250 50  0000 L CNN
F 1 "1u" H 4400 2050 50  0000 L CNN
F 2 "Capacitor_SMD:C_0805_2012Metric_Pad1.15x1.40mm_HandSolder" H 4438 2000 50  0001 C CNN
F 3 "~" H 4400 2150 50  0001 C CNN
F 4 "2896651" H 4400 2150 50  0001 C CNN "Farnell"
F 5 "0,247" H 4400 2150 50  0001 C CNN "Prix Unit"
	1    4400 2150
	1    0    0    -1  
$EndComp
Wire Wire Line
	3600 2300 3700 2300
Wire Wire Line
	4300 2300 4400 2300
Wire Wire Line
	3600 2000 4000 2000
Connection ~ 4000 2000
Wire Wire Line
	4000 2000 4400 2000
$Comp
L Regulator_Linear:MC78M05_TO252 U9
U 1 1 5DD52E43
P 4000 1500
F 0 "U9" H 4000 1742 50  0000 C CNN
F 1 "MC78M08_TO252" H 4000 1651 50  0000 C CNN
F 2 "Package_TO_SOT_SMD:TO-252-2" H 4000 1725 50  0001 C CIN
F 3 "https://www.onsemi.com/pub/Collateral/MC78M00-D.PDF" H 4000 1450 50  0001 C CNN
F 4 "1652353" H 4000 1500 50  0001 C CNN "Farnell"
F 5 "0,383" H 4000 1500 50  0001 C CNN "Prix Unit"
	1    4000 1500
	1    0    0    -1  
$EndComp
$Comp
L Device:C C6
U 1 1 5DD55D45
P 4400 1650
F 0 "C6" H 4400 1750 50  0000 L CNN
F 1 "1u" H 4400 1550 50  0000 L CNN
F 2 "Capacitor_SMD:C_0805_2012Metric_Pad1.15x1.40mm_HandSolder" H 4438 1500 50  0001 C CNN
F 3 "~" H 4400 1650 50  0001 C CNN
F 4 "2896651" H 4400 1650 50  0001 C CNN "Farnell"
F 5 "0,247" H 4400 1650 50  0001 C CNN "Prix Unit"
	1    4400 1650
	1    0    0    -1  
$EndComp
$Comp
L Device:C C5
U 1 1 5DD56037
P 3600 1650
F 0 "C5" H 3600 1750 50  0000 R CNN
F 1 "330n" H 3600 1550 50  0000 R CNN
F 2 "Capacitor_SMD:C_0805_2012Metric_Pad1.15x1.40mm_HandSolder" H 3638 1500 50  0001 C CNN
F 3 "~" H 3600 1650 50  0001 C CNN
F 4 "2991367" H 3600 1650 50  0001 C CNN "Farnell"
F 5 "0,171" H 3600 1650 50  0001 C CNN "Prix Unit"
	1    3600 1650
	1    0    0    -1  
$EndComp
Wire Wire Line
	3600 1800 4000 1800
Connection ~ 4000 1800
Wire Wire Line
	4000 1800 4400 1800
Wire Wire Line
	4400 1500 4300 1500
Wire Wire Line
	3700 1500 3600 1500
$Comp
L power:GND #PWR0116
U 1 1 5DD5BDAD
P 3300 1900
F 0 "#PWR0116" H 3300 1650 50  0001 C CNN
F 1 "GND" H 3300 1750 50  0000 C CNN
F 2 "" H 3300 1900 50  0001 C CNN
F 3 "" H 3300 1900 50  0001 C CNN
	1    3300 1900
	0    1    1    0   
$EndComp
Wire Wire Line
	3600 1500 3300 1500
Wire Wire Line
	3600 2300 3300 2300
Text Label 3300 1500 2    50   ~ 0
Alim+
Text Label 3300 2300 2    50   ~ 0
Alim-
Wire Wire Line
	4400 1500 4700 1500
Wire Wire Line
	4700 2300 4400 2300
Connection ~ 3600 1500
Connection ~ 3600 2300
Connection ~ 4400 2300
Connection ~ 4400 1500
Wire Wire Line
	4000 1800 4000 1900
Wire Wire Line
	3300 1900 4000 1900
Connection ~ 4000 1900
Wire Wire Line
	4000 1900 4000 2000
NoConn ~ 7900 5250
NoConn ~ 7900 5350
$Comp
L power:+8V #PWR0118
U 1 1 5DDCAB87
P 4700 1500
F 0 "#PWR0118" H 4700 1350 50  0001 C CNN
F 1 "+8V" H 4700 1650 50  0000 C CNN
F 2 "" H 4700 1500 50  0001 C CNN
F 3 "" H 4700 1500 50  0001 C CNN
	1    4700 1500
	1    0    0    -1  
$EndComp
$Comp
L power:+8V #PWR0123
U 1 1 5DDCD3B8
P 7900 5450
F 0 "#PWR0123" H 7900 5300 50  0001 C CNN
F 1 "+8V" V 7900 5550 50  0000 L CNN
F 2 "" H 7900 5450 50  0001 C CNN
F 3 "" H 7900 5450 50  0001 C CNN
	1    7900 5450
	0    -1   -1   0   
$EndComp
Connection ~ 5600 1500
Wire Wire Line
	5600 1500 5300 1500
Wire Wire Line
	6400 1500 6700 1500
Wire Wire Line
	6000 1800 6400 1800
Connection ~ 6000 1800
Wire Wire Line
	5600 1800 6000 1800
Wire Wire Line
	6000 1900 6000 1800
Wire Wire Line
	5500 1900 6000 1900
Connection ~ 6400 1500
$Comp
L power:+5V #PWR01
U 1 1 5C644B68
P 6700 1500
F 0 "#PWR01" H 6700 1350 50  0001 C CNN
F 1 "+5V" H 6700 1650 50  0000 C CNN
F 2 "" H 6700 1500 50  0001 C CNN
F 3 "" H 6700 1500 50  0001 C CNN
	1    6700 1500
	1    0    0    -1  
$EndComp
Wire Wire Line
	6300 1500 6400 1500
Wire Wire Line
	5600 1500 5700 1500
$Comp
L Device:C C4
U 1 1 5C64283C
P 6400 1650
F 0 "C4" H 6400 1750 50  0000 L CNN
F 1 "100n" H 6400 1550 50  0000 L CNN
F 2 "Capacitor_SMD:C_0805_2012Metric_Pad1.15x1.40mm_HandSolder" H 6438 1500 50  0001 C CNN
F 3 "~" H 6400 1650 50  0001 C CNN
F 4 "2896622" H 6400 1650 50  0001 C CNN "Farnell"
F 5 "0,133" H 6400 1650 50  0001 C CNN "Prix Unit"
	1    6400 1650
	1    0    0    -1  
$EndComp
$Comp
L Device:C C3
U 1 1 5C6427EA
P 5600 1650
F 0 "C3" H 5600 1750 50  0000 R CNN
F 1 "330n" H 5600 1550 50  0000 R CNN
F 2 "Capacitor_SMD:C_0805_2012Metric_Pad1.15x1.40mm_HandSolder" H 5638 1500 50  0001 C CNN
F 3 "~" H 5600 1650 50  0001 C CNN
F 4 "2991367" H 5600 1650 50  0001 C CNN "Farnell"
F 5 "0,171" H 5600 1650 50  0001 C CNN "Prix Unit"
	1    5600 1650
	1    0    0    -1  
$EndComp
$Comp
L Regulator_Linear:L78L05_SOT89 U5
U 1 1 5C640105
P 6000 1500
F 0 "U5" H 6100 1250 50  0000 C CNN
F 1 "L78L05" H 6000 1650 50  0000 C CNN
F 2 "Package_TO_SOT_SMD:SOT-89-3" H 6000 1700 50  0001 C CIN
F 3 "http://www.st.com/content/ccc/resource/technical/document/datasheet/15/55/e5/aa/23/5b/43/fd/CD00000446.pdf/files/CD00000446.pdf/jcr:content/translations/en.CD00000446.pdf" H 6000 1450 50  0001 C CNN
F 4 "1467762" H 6000 1500 50  0001 C CNN "Farnell"
F 5 "0,393" H 6000 1500 50  0001 C CNN "Prix Unit"
	1    6000 1500
	1    0    0    -1  
$EndComp
$Comp
L power:GND #PWR04
U 1 1 5C645F8C
P 5500 1900
F 0 "#PWR04" H 5500 1650 50  0001 C CNN
F 1 "GND" H 5500 1750 50  0000 C CNN
F 2 "" H 5500 1900 50  0001 C CNN
F 3 "" H 5500 1900 50  0001 C CNN
	1    5500 1900
	0    1    1    0   
$EndComp
$Comp
L power:+8V #PWR0119
U 1 1 5DDCAFDE
P 5300 1500
F 0 "#PWR0119" H 5300 1350 50  0001 C CNN
F 1 "+8V" H 5300 1650 50  0000 C CNN
F 2 "" H 5300 1500 50  0001 C CNN
F 3 "" H 5300 1500 50  0001 C CNN
	1    5300 1500
	1    0    0    -1  
$EndComp
$Comp
L power:-8V #PWR0120
U 1 1 5DDBAE15
P 5300 2300
F 0 "#PWR0120" H 5300 2400 50  0001 C CNN
F 1 "-8V" H 5300 2450 50  0000 C CNN
F 2 "" H 5300 2300 50  0001 C CNN
F 3 "" H 5300 2300 50  0001 C CNN
	1    5300 2300
	-1   0    0    1   
$EndComp
Wire Wire Line
	6700 2300 6400 2300
Connection ~ 6000 1900
Wire Wire Line
	6000 2000 6000 1900
Wire Wire Line
	6000 2000 6400 2000
Connection ~ 6000 2000
Wire Wire Line
	5600 2000 6000 2000
$Comp
L Device:C C8
U 1 1 5C640229
P 6400 2150
F 0 "C8" H 6400 2250 50  0000 L CNN
F 1 "100n" H 6400 2050 50  0000 L CNN
F 2 "Capacitor_SMD:C_0805_2012Metric_Pad1.15x1.40mm_HandSolder" H 6438 2000 50  0001 C CNN
F 3 "~" H 6400 2150 50  0001 C CNN
F 4 "2896622" H 6400 2150 50  0001 C CNN "Farnell"
F 5 "0,133" H 6400 2150 50  0001 C CNN "Prix Unit"
	1    6400 2150
	1    0    0    -1  
$EndComp
Connection ~ 6400 2300
Wire Wire Line
	6300 2300 6400 2300
Wire Wire Line
	5600 2300 5300 2300
Wire Wire Line
	5600 2300 5700 2300
Connection ~ 5600 2300
$Comp
L Device:C C7
U 1 1 5C640155
P 5600 2150
F 0 "C7" H 5600 2250 50  0000 R CNN
F 1 "330n" H 5600 2050 50  0000 R CNN
F 2 "Capacitor_SMD:C_0805_2012Metric_Pad1.15x1.40mm_HandSolder" H 5638 2000 50  0001 C CNN
F 3 "~" H 5600 2150 50  0001 C CNN
F 4 "2991367" H 5600 2150 50  0001 C CNN "Farnell"
F 5 "0,171" H 5600 2150 50  0001 C CNN "Prix Unit"
	1    5600 2150
	1    0    0    -1  
$EndComp
$Comp
L Regulator_Linear:L79L05_SOT89 U8
U 1 1 5C63FFBD
P 6000 2300
F 0 "U8" H 6100 2550 50  0000 C CNN
F 1 "L79L05" H 6000 2150 50  0000 C CNN
F 2 "Package_TO_SOT_SMD:SOT-89-3" H 6000 2100 50  0001 C CIN
F 3 "http://www.farnell.com/datasheets/1827870.pdf" H 6000 2300 50  0001 C CNN
F 4 "1467770" H 6000 2300 50  0001 C CNN "Farnell"
F 5 "0,34" H 6000 2300 50  0001 C CNN "Prix Unit"
	1    6000 2300
	1    0    0    -1  
$EndComp
$Comp
L power:-5V #PWR?
U 1 1 5C644C63
P 6700 2300
AR Path="/5C1A74E1/5C3BCAE0/5C644C63" Ref="#PWR?"  Part="1" 
AR Path="/5C1A74E1/5C3C0050/5C644C63" Ref="#PWR?"  Part="1" 
AR Path="/5C1A74E1/5C3C280E/5C644C63" Ref="#PWR?"  Part="1" 
AR Path="/5C1A74E1/5C3CEAFB/5C644C63" Ref="#PWR?"  Part="1" 
AR Path="/5C1A74E1/5C644C63" Ref="#PWR?"  Part="1" 
AR Path="/5C644C63" Ref="#PWR05"  Part="1" 
F 0 "#PWR05" H 6700 2400 50  0001 C CNN
F 1 "-5V" H 6700 2450 50  0000 C CNN
F 2 "" H 6700 2300 50  0001 C CNN
F 3 "" H 6700 2300 50  0001 C CNN
	1    6700 2300
	-1   0    0    1   
$EndComp
$Comp
L power:-8V #PWR0117
U 1 1 5DD692EA
P 4700 2300
F 0 "#PWR0117" H 4700 2400 50  0001 C CNN
F 1 "-8V" H 4700 2450 50  0000 C CNN
F 2 "" H 4700 2300 50  0001 C CNN
F 3 "" H 4700 2300 50  0001 C CNN
	1    4700 2300
	-1   0    0    1   
$EndComp
Text Label 2300 1800 0    50   ~ 0
Alim+
Text Label 2300 2000 0    50   ~ 0
Alim-
$Comp
L Connector_Generic:Conn_01x03 J2
U 1 1 5C76BEC7
P 2100 1900
F 0 "J2" H 2100 2100 50  0000 C CNN
F 1 "Conn_01x03" H 2100 1700 50  0000 C CNN
F 2 "TerminalBlock_Phoenix_PTS:PhoenixContact_PTS_1,5_3-5.0-H_1x03_P5.00mm_Horizontal" H 2100 1900 50  0001 C CNN
F 3 "~" H 2100 1900 50  0001 C CNN
F 4 "RS: 897-0705" H 2100 1900 50  0001 C CNN "Farnell"
	1    2100 1900
	-1   0    0    1   
$EndComp
$Comp
L power:GND #PWR02
U 1 1 5C519104
P 2500 1900
F 0 "#PWR02" H 2500 1650 50  0001 C CNN
F 1 "GND" H 2500 1750 50  0000 C CNN
F 2 "" H 2500 1900 50  0001 C CNN
F 3 "" H 2500 1900 50  0001 C CNN
	1    2500 1900
	0    -1   -1   0   
$EndComp
Wire Wire Line
	2300 1800 2500 1800
Wire Wire Line
	2300 2000 2500 2000
Wire Wire Line
	2300 1900 2500 1900
$Comp
L power:PWR_FLAG #FLG0101
U 1 1 5DDD5566
P 2500 1800
F 0 "#FLG0101" H 2500 1875 50  0001 C CNN
F 1 "PWR_FLAG" V 2500 1928 50  0001 L CNN
F 2 "" H 2500 1800 50  0001 C CNN
F 3 "~" H 2500 1800 50  0001 C CNN
	1    2500 1800
	0    1    1    0   
$EndComp
$Comp
L power:PWR_FLAG #FLG0102
U 1 1 5DDD769F
P 2500 2000
F 0 "#FLG0102" H 2500 2075 50  0001 C CNN
F 1 "PWR_FLAG" V 2500 2128 50  0001 L CNN
F 2 "" H 2500 2000 50  0001 C CNN
F 3 "~" H 2500 2000 50  0001 C CNN
	1    2500 2000
	0    1    1    0   
$EndComp
$Comp
L power:PWR_FLAG #FLG0103
U 1 1 5DDD9009
P 2300 1900
F 0 "#FLG0103" H 2300 1975 50  0001 C CNN
F 1 "PWR_FLAG" V 2300 2028 50  0001 L CNN
F 2 "" H 2300 1900 50  0001 C CNN
F 3 "~" H 2300 1900 50  0001 C CNN
	1    2300 1900
	0    1    1    0   
$EndComp
Connection ~ 2300 1900
$Comp
L Regulator_Linear:MC79M08_TO252 U11
U 1 1 5DD3EF6C
P 4000 2300
F 0 "U11" H 4000 2151 50  0000 C CNN
F 1 "MC79M08_TO252" H 4000 2060 50  0000 C CNN
F 2 "Package_TO_SOT_SMD:TO-252-2" H 4000 2100 50  0001 C CIN
F 3 "http://www.onsemi.com/pub/Collateral/MC79M00-D.PDF" H 4000 2300 50  0001 C CNN
F 4 "2534225" H 4000 2300 50  0001 C CNN "Farnell"
F 5 "0,501" H 4000 2300 50  0001 C CNN "Prix Unit"
	1    4000 2300
	1    0    0    -1  
$EndComp
Text Notes 3500 3500 0    50   ~ 0
SMP04 work better at 15V, but 16V (-8V,+8V) are in the 17V accepted range.\nWith this supply we have : -7.95V ≤ Vout ≤ +6V\n\n74HC4051 max recommended supply is 10V (-5V, +5V).\n\nInput voltage range on Arduino ADC is [0V, 5V], ensured by the op amp.
$Comp
L Amplifier_Operational:TSV912IST U7
U 1 1 5DD5AEB1
P 5000 6200
F 0 "U7" H 5000 6350 50  0000 C CNN
F 1 "TSV912IST" H 5000 6200 50  0000 C CNN
F 2 "Package_SO:MSOP-8_3x3mm_P0.65mm" H 5000 6200 50  0001 C CNN
F 3 "www.st.com/resource/en/datasheet/tsv911.pdf" H 5000 6200 50  0001 C CNN
F 4 "1842603" H 5000 6200 50  0001 C CNN "Farnell"
F 5 "0,662" H 5000 6200 50  0001 C CNN "Prix Unit"
	1    5000 6200
	1    0    0    -1  
$EndComp
$Comp
L Amplifier_Operational:TSV912IST U7
U 3 1 5DD644ED
P 4600 7200
F 0 "U7" H 4558 7246 50  0000 L CNN
F 1 "TSV912IST" H 4558 7155 50  0000 L CNN
F 2 "Package_SO:MSOP-8_3x3mm_P0.65mm" H 4600 7200 50  0001 C CNN
F 3 "www.st.com/resource/en/datasheet/tsv911.pdf" H 4600 7200 50  0001 C CNN
F 4 "1842603" H 4600 7200 50  0001 C CNN "Farnell"
F 5 "0,662" H 4600 7200 50  0001 C CNN "Prix Unit"
	3    4600 7200
	1    0    0    -1  
$EndComp
$Comp
L power:GND #PWR0122
U 1 1 5DD6BF23
P 4500 7500
AR Path="/5DD6BF23" Ref="#PWR0122"  Part="1" 
AR Path="/5C1AEE01/5DD6BF23" Ref="#PWR?"  Part="1" 
AR Path="/5C1AA865/5C1B8C06/5DD6BF23" Ref="#PWR?"  Part="1" 
AR Path="/5C1AA865/5C1EBB42/5DD6BF23" Ref="#PWR?"  Part="1" 
AR Path="/5C1AA865/5C1F1EC5/5DD6BF23" Ref="#PWR?"  Part="1" 
AR Path="/5C1AA865/5C1F9233/5DD6BF23" Ref="#PWR?"  Part="1" 
AR Path="/5C1AA865/5C200A3E/5DD6BF23" Ref="#PWR?"  Part="1" 
AR Path="/5C1AA865/5C209418/5DD6BF23" Ref="#PWR?"  Part="1" 
AR Path="/5C1AA865/5C2124D5/5DD6BF23" Ref="#PWR?"  Part="1" 
AR Path="/5C1AA865/5C21C13B/5DD6BF23" Ref="#PWR?"  Part="1" 
AR Path="/5C1AA865/5C226C26/5DD6BF23" Ref="#PWR?"  Part="1" 
AR Path="/5C1AA865/5C2328D4/5DD6BF23" Ref="#PWR?"  Part="1" 
AR Path="/5C1AA865/5C23F401/5DD6BF23" Ref="#PWR?"  Part="1" 
AR Path="/5C1AA865/5C24C9A5/5DD6BF23" Ref="#PWR?"  Part="1" 
AR Path="/5C1AA865/5C25C084/5DD6BF23" Ref="#PWR?"  Part="1" 
AR Path="/5C1AA865/5C2FE807/5DD6BF23" Ref="#PWR?"  Part="1" 
AR Path="/5C1AA865/5C30DB75/5DD6BF23" Ref="#PWR?"  Part="1" 
AR Path="/5C1AA865/5C31CE81/5DD6BF23" Ref="#PWR?"  Part="1" 
AR Path="/5C1AA865/5C32B921/5DD6BF23" Ref="#PWR?"  Part="1" 
AR Path="/5C1AA865/5C33B55D/5DD6BF23" Ref="#PWR?"  Part="1" 
AR Path="/5C1AA865/5C34ADC5/5DD6BF23" Ref="#PWR?"  Part="1" 
AR Path="/5C1AA865/5C359865/5DD6BF23" Ref="#PWR?"  Part="1" 
AR Path="/5C1AA865/5C3689E9/5DD6BF23" Ref="#PWR?"  Part="1" 
AR Path="/5C1AA865/5C377B0B/5DD6BF23" Ref="#PWR?"  Part="1" 
AR Path="/5C1AA865/5C3865AB/5DD6BF23" Ref="#PWR?"  Part="1" 
AR Path="/5C1AA865/5C3957F3/5DD6BF23" Ref="#PWR?"  Part="1" 
AR Path="/5C1AA865/5C3A4293/5DD6BF23" Ref="#PWR?"  Part="1" 
AR Path="/5C1A74E1/5DD6BF23" Ref="#PWR?"  Part="1" 
AR Path="/5C1A74E1/5C36C53A/5C36DE5B/5DD6BF23" Ref="#PWR?"  Part="1" 
F 0 "#PWR0122" H 4500 7250 50  0001 C CNN
F 1 "GND" H 4500 7350 50  0000 C CNN
F 2 "" H 4500 7500 50  0001 C CNN
F 3 "" H 4500 7500 50  0001 C CNN
	1    4500 7500
	1    0    0    -1  
$EndComp
$Comp
L power:+5V #PWR0124
U 1 1 5DD6C36F
P 4500 6900
F 0 "#PWR0124" H 4500 6750 50  0001 C CNN
F 1 "+5V" H 4500 7050 50  0000 C CNN
F 2 "" H 4500 6900 50  0001 C CNN
F 3 "" H 4500 6900 50  0001 C CNN
	1    4500 6900
	1    0    0    -1  
$EndComp
Wire Wire Line
	4600 6100 4700 6100
Wire Wire Line
	4600 6300 4700 6300
Wire Wire Line
	4600 6300 4600 6600
$Comp
L Device:C C10
U 1 1 5DD8A9DD
P 4300 7250
F 0 "C10" H 4300 7350 50  0000 L CNN
F 1 "10n" H 4300 7100 50  0000 L CNN
F 2 "Capacitor_SMD:C_1206_3216Metric_Pad1.42x1.75mm_HandSolder" H 4338 7100 50  0001 C CNN
F 3 "~" H 4300 7250 50  0001 C CNN
F 4 "2896636" H -550 450 50  0001 C CNN "Farnell"
F 5 "0,0745" H -550 450 50  0001 C CNN "Prix Unit"
F 6 "VJ1206Y103KXACW1BC" H -550 450 50  0001 C CNN "Ref Fabricant"
	1    4300 7250
	-1   0    0    -1  
$EndComp
Wire Wire Line
	4500 6900 4300 6900
Wire Wire Line
	4300 6900 4300 7100
Wire Wire Line
	4300 7500 4500 7500
Wire Wire Line
	4300 7400 4300 7500
Connection ~ 4500 6900
Connection ~ 4500 7500
$Comp
L Amplifier_Operational:TSV912IST U7
U 2 1 5DD9D10A
P 6300 6900
F 0 "U7" H 6300 7050 50  0000 C CNN
F 1 "TSV912IST" H 6300 6900 50  0000 C CNN
F 2 "Package_SO:MSOP-8_3x3mm_P0.65mm" H 6300 6900 50  0001 C CNN
F 3 "www.st.com/resource/en/datasheet/tsv911.pdf" H 6300 6900 50  0001 C CNN
F 4 "1842603" H 6300 6900 50  0001 C CNN "Farnell"
F 5 "0,662" H 6300 6900 50  0001 C CNN "Prix Unit"
	2    6300 6900
	1    0    0    -1  
$EndComp
$Comp
L power:GND #PWR0125
U 1 1 5DD9E9FD
P 6000 6800
F 0 "#PWR0125" H 6000 6550 50  0001 C CNN
F 1 "GND" H 6000 6650 50  0000 C CNN
F 2 "" H 6000 6800 50  0001 C CNN
F 3 "" H 6000 6800 50  0001 C CNN
	1    6000 6800
	0    1    1    0   
$EndComp
Wire Wire Line
	6600 6900 6600 7200
Wire Wire Line
	6600 7200 6000 7200
Wire Wire Line
	6000 7200 6000 7000
$EndSCHEMATC
