EESchema Schematic File Version 4
EELAYER 30 0
EELAYER END
$Descr A4 11693 8268
encoding utf-8
Sheet 3 3
Title "BE d'Elec - Semestre 2"
Date ""
Rev ""
Comp "Grenoble-Inp Phelma"
Comment1 ""
Comment2 ""
Comment3 ""
Comment4 ""
$EndDescr
$Comp
L power:GND2 #PWR03
U 1 1 61D82388
P 10000 1000
F 0 "#PWR03" H 10000 750 50  0001 C CNN
F 1 "GND2" H 10005 827 50  0000 C CNN
F 2 "" H 10000 1000 50  0001 C CNN
F 3 "" H 10000 1000 50  0001 C CNN
	1    10000 1000
	1    0    0    -1  
$EndComp
Wire Wire Line
	10000 800  10000 850 
Wire Wire Line
	10000 850  10150 850 
Wire Wire Line
	10150 950  10000 950 
Wire Wire Line
	10000 950  10000 1000
Text GLabel 10000 800  0    50   Input ~ 0
VCC2
$Comp
L Connector_Generic:Conn_01x02 J6
U 1 1 61DEB856
P 10350 850
F 0 "J6" H 10430 842 50  0000 L CNN
F 1 "Conn_01x02" H 10430 751 50  0000 L CNN
F 2 "LIB_BE_PHELMA:PinHeader_1x02_P2.54mm_Vertical" H 10350 850 50  0001 C CNN
F 3 "~" H 10350 850 50  0001 C CNN
	1    10350 850 
	1    0    0    -1  
$EndComp
$Comp
L power:GND2 #PWR0108
U 1 1 61DEBFB2
P 9050 1000
F 0 "#PWR0108" H 9050 750 50  0001 C CNN
F 1 "GND2" H 9055 827 50  0000 C CNN
F 2 "" H 9050 1000 50  0001 C CNN
F 3 "" H 9050 1000 50  0001 C CNN
	1    9050 1000
	1    0    0    -1  
$EndComp
Wire Wire Line
	9050 800  9050 850 
Wire Wire Line
	9050 850  9200 850 
Wire Wire Line
	9200 950  9050 950 
Wire Wire Line
	9050 950  9050 1000
Text GLabel 9050 800  0    50   Input ~ 0
VCC2
$Comp
L Connector_Generic:Conn_01x02 J5
U 1 1 61DEBFE9
P 9400 850
F 0 "J5" H 9480 842 50  0000 L CNN
F 1 "Conn_01x02" H 9480 751 50  0000 L CNN
F 2 "LIB_BE_PHELMA:PinHeader_1x02_P2.54mm_Vertical" H 9400 850 50  0001 C CNN
F 3 "~" H 9400 850 50  0001 C CNN
	1    9400 850 
	1    0    0    -1  
$EndComp
$Comp
L Connector_Generic:Conn_01x02 J7
U 1 1 61DED524
P 10350 1300
F 0 "J7" H 10430 1292 50  0000 L CNN
F 1 "Conn_01x02" H 10430 1201 50  0000 L CNN
F 2 "LIB_BE_PHELMA:PinHeader_1x02_P2.54mm_Vertical" H 10350 1300 50  0001 C CNN
F 3 "~" H 10350 1300 50  0001 C CNN
	1    10350 1300
	1    0    0    -1  
$EndComp
$Comp
L power:GND2 #PWR0109
U 1 1 61DED9AA
P 10000 1450
F 0 "#PWR0109" H 10000 1200 50  0001 C CNN
F 1 "GND2" H 10005 1277 50  0000 C CNN
F 2 "" H 10000 1450 50  0001 C CNN
F 3 "" H 10000 1450 50  0001 C CNN
	1    10000 1450
	1    0    0    -1  
$EndComp
Wire Wire Line
	10150 1300 10000 1300
Wire Wire Line
	10000 1300 10000 1400
Wire Wire Line
	10150 1400 10000 1400
Connection ~ 10000 1400
Wire Wire Line
	10000 1400 10000 1450
$Comp
L Connector_Generic:Conn_01x02 Jin4
U 1 1 61DEE04D
P 750 3200
F 0 "Jin4" H 668 3417 50  0000 C CNN
F 1 "Conn_01x02" H 668 3326 50  0000 C CNN
F 2 "LIB_BE_PHELMA:PinHeader_1x02_P2.54mm_Vertical" H 750 3200 50  0001 C CNN
F 3 "~" H 750 3200 50  0001 C CNN
	1    750  3200
	-1   0    0    -1  
$EndComp
Wire Wire Line
	950  3200 1900 3200
$Comp
L power:GND2 #PWR0110
U 1 1 61DEEBA6
P 950 3300
F 0 "#PWR0110" H 950 3050 50  0001 C CNN
F 1 "GND2" H 955 3127 50  0000 C CNN
F 2 "" H 950 3300 50  0001 C CNN
F 3 "" H 950 3300 50  0001 C CNN
	1    950  3300
	1    0    0    -1  
$EndComp
Wire Notes Line
	500  2800 1600 2800
Wire Notes Line
	1600 2800 1600 3850
Wire Notes Line
	1600 3850 500  3850
Wire Notes Line
	500  3850 500  2800
Text Notes 850  3850 0    50   ~ 0
Entrée Carte 2\nNE PAS Modifier\nNE PAS Supprimer
Wire Notes Line
	8750 1800 8750 700 
Text Notes 8750 1800 0    50   ~ 0
Alimentation Carte 2 - NE PAS Modifier - NE PAS Supprimer
Wire Notes Line
	11150 1800 11150 700 
Wire Notes Line
	8750 700  11150 700 
Wire Notes Line
	8750 1800 11150 1800
$Comp
L power:PWR_FLAG #FLG0102
U 1 1 61DF261A
P 9050 950
F 0 "#FLG0102" H 9050 1025 50  0001 C CNN
F 1 "PWR_FLAG" V 9050 1077 50  0000 L CNN
F 2 "" H 9050 950 50  0001 C CNN
F 3 "~" H 9050 950 50  0001 C CNN
	1    9050 950 
	0    -1   -1   0   
$EndComp
Connection ~ 9050 950 
$EndSCHEMATC
