EESchema Schematic File Version 4
EELAYER 30 0
EELAYER END
$Descr A4 11693 8268
encoding utf-8
Sheet 2 3
Title "BE d'Elec - Semestre 2"
Date ""
Rev ""
Comp "Grenoble-Inp Phelma"
Comment1 ""
Comment2 ""
Comment3 ""
Comment4 ""
$EndDescr
$Comp
L power:GND1 #PWR02
U 1 1 61D81D78
P 9400 950
F 0 "#PWR02" H 9400 700 50  0001 C CNN
F 1 "GND1" H 9405 777 50  0000 C CNN
F 2 "" H 9400 950 50  0001 C CNN
F 3 "" H 9400 950 50  0001 C CNN
	1    9400 950 
	1    0    0    -1  
$EndComp
$Comp
L Connector_Generic:Conn_01x02 J2
U 1 1 61D835E4
P 9700 800
F 0 "J2" H 9780 792 50  0000 L CNN
F 1 "Conn_01x02" H 9780 701 50  0000 L CNN
F 2 "LIB_BE_PHELMA:PinSocket_1x02_P2.54mm_Vertical" H 9700 800 50  0001 C CNN
F 3 "~" H 9700 800 50  0001 C CNN
	1    9700 800 
	1    0    0    -1  
$EndComp
Wire Wire Line
	9400 900  9400 950 
Text GLabel 9400 800  0    50   Input ~ 0
VCC1
$Comp
L Regulator_Linear:TLV1117-50 UAlim1
U 1 1 61DA1190
P 8450 800
F 0 "UAlim1" H 8450 1042 50  0000 C CNN
F 1 "TLV1117-50" H 8450 951 50  0000 C CNN
F 2 "LIB_BE_PHELMA_CMS:SOT-223-3_TabPin2" H 8450 800 50  0001 C CNN
F 3 "http://www.ti.com/lit/ds/symlink/tlv1117.pdf" H 8450 800 50  0001 C CNN
	1    8450 800 
	1    0    0    -1  
$EndComp
Wire Wire Line
	9400 900  9500 900 
Wire Wire Line
	9500 800  9400 800 
$Comp
L power:GND1 #PWR0101
U 1 1 61DA6905
P 10350 950
F 0 "#PWR0101" H 10350 700 50  0001 C CNN
F 1 "GND1" H 10355 777 50  0000 C CNN
F 2 "" H 10350 950 50  0001 C CNN
F 3 "" H 10350 950 50  0001 C CNN
	1    10350 950 
	1    0    0    -1  
$EndComp
$Comp
L Connector_Generic:Conn_01x02 J3
U 1 1 61DA6969
P 10650 800
F 0 "J3" H 10730 792 50  0000 L CNN
F 1 "Conn_01x02" H 10730 701 50  0000 L CNN
F 2 "LIB_BE_PHELMA:PinSocket_1x02_P2.54mm_Vertical" H 10650 800 50  0001 C CNN
F 3 "~" H 10650 800 50  0001 C CNN
	1    10650 800 
	1    0    0    -1  
$EndComp
Wire Wire Line
	10350 900  10350 950 
Text GLabel 10350 800  0    50   Input ~ 0
VCC1
Wire Wire Line
	10350 900  10450 900 
Wire Wire Line
	10450 800  10350 800 
Text GLabel 8850 800  2    50   Input ~ 0
VCC1
$Comp
L power:GND1 #PWR0102
U 1 1 61DAD27F
P 8450 1200
F 0 "#PWR0102" H 8450 950 50  0001 C CNN
F 1 "GND1" H 8455 1027 50  0000 C CNN
F 2 "" H 8450 1200 50  0001 C CNN
F 3 "" H 8450 1200 50  0001 C CNN
	1    8450 1200
	1    0    0    -1  
$EndComp
$Comp
L Device:LED D1
U 1 1 61DADDAD
P 10650 1450
F 0 "D1" H 10643 1195 50  0000 C CNN
F 1 "LED" H 10643 1286 50  0000 C CNN
F 2 "LIB_BE_PHELMA_CMS:LED_1206_3216Metric_Pad1.42x1.75mm_HandSolder" H 10650 1450 50  0001 C CNN
F 3 "~" H 10650 1450 50  0001 C CNN
	1    10650 1450
	-1   0    0    1   
$EndComp
$Comp
L Device:R RD1
U 1 1 61DAE808
P 10300 1450
F 0 "RD1" V 10093 1450 50  0000 C CNN
F 1 "470" V 10184 1450 50  0000 C CNN
F 2 "LIB_BE_PHELMA_CMS:R_1206_3216Metric_Pad1.42x1.75mm_HandSolder" V 10230 1450 50  0001 C CNN
F 3 "~" H 10300 1450 50  0001 C CNN
	1    10300 1450
	0    1    1    0   
$EndComp
$Comp
L power:GND1 #PWR0103
U 1 1 61DAEC5F
P 10850 1450
F 0 "#PWR0103" H 10850 1200 50  0001 C CNN
F 1 "GND1" H 10855 1277 50  0000 C CNN
F 2 "" H 10850 1450 50  0001 C CNN
F 3 "" H 10850 1450 50  0001 C CNN
	1    10850 1450
	0    -1   -1   0   
$EndComp
Text GLabel 10100 1450 0    50   Input ~ 0
VCC1
Wire Wire Line
	10100 1450 10150 1450
Wire Wire Line
	10450 1450 10500 1450
Wire Wire Line
	10800 1450 10850 1450
Wire Wire Line
	8750 800  8800 800 
Wire Wire Line
	8450 1100 8450 1150
$Comp
L Connector_Generic:Conn_01x02 J4
U 1 1 61DB12C2
P 10650 1850
F 0 "J4" H 10730 1842 50  0000 L CNN
F 1 "Conn_01x02" H 10730 1751 50  0000 L CNN
F 2 "LIB_BE_PHELMA:PinSocket_1x02_P2.54mm_Vertical" H 10650 1850 50  0001 C CNN
F 3 "~" H 10650 1850 50  0001 C CNN
	1    10650 1850
	1    0    0    -1  
$EndComp
$Comp
L power:GND1 #PWR0104
U 1 1 61DB2022
P 10350 2000
F 0 "#PWR0104" H 10350 1750 50  0001 C CNN
F 1 "GND1" H 10355 1827 50  0000 C CNN
F 2 "" H 10350 2000 50  0001 C CNN
F 3 "" H 10350 2000 50  0001 C CNN
	1    10350 2000
	1    0    0    -1  
$EndComp
Wire Wire Line
	10450 1950 10350 1950
Wire Wire Line
	10350 1950 10350 2000
Wire Wire Line
	10350 1950 10350 1850
Wire Wire Line
	10350 1850 10450 1850
Connection ~ 10350 1950
$Comp
L Connector_Generic:Conn_01x02 JS1
U 1 1 61DB4611
P 10650 3100
F 0 "JS1" H 10730 3092 50  0000 L CNN
F 1 "Conn_Sortie" H 10730 3001 50  0000 L CNN
F 2 "LIB_BE_PHELMA:PinSocket_1x02_P2.54mm_Vertical" H 10650 3100 50  0001 C CNN
F 3 "~" H 10650 3100 50  0001 C CNN
	1    10650 3100
	1    0    0    -1  
$EndComp
$Comp
L Device:CP C2
U 1 1 61DB5D70
P 8800 1000
F 0 "C2" H 8918 1046 50  0000 L CNN
F 1 "100µF" H 8918 955 50  0000 L CNN
F 2 "LIB_BE_PHELMA_CMS:CP_Elec_6.3x5.2" H 8838 850 50  0001 C CNN
F 3 "~" H 8800 1000 50  0001 C CNN
	1    8800 1000
	1    0    0    -1  
$EndComp
Wire Wire Line
	8800 800  8800 850 
Connection ~ 8800 800 
Wire Wire Line
	8800 800  8850 800 
Wire Wire Line
	8800 1150 8450 1150
Connection ~ 8450 1150
Wire Wire Line
	8450 1150 8450 1200
$Comp
L Device:C C1
U 1 1 61DB6D99
P 8000 1000
F 0 "C1" H 8115 1046 50  0000 L CNN
F 1 "10µF" H 8115 955 50  0000 L CNN
F 2 "LIB_BE_PHELMA_CMS:C_1206_3216Metric_Pad1.42x1.75mm_HandSolder" H 8038 850 50  0001 C CNN
F 3 "~" H 8000 1000 50  0001 C CNN
	1    8000 1000
	1    0    0    -1  
$EndComp
Wire Wire Line
	8450 1150 8000 1150
Wire Wire Line
	8150 800  8050 800 
Wire Wire Line
	8000 800  8000 850 
Connection ~ 8000 800 
$Comp
L Connector:Barrel_Jack_Switch J1
U 1 1 61DBA848
P 7450 900
F 0 "J1" H 7220 850 50  0000 R CNN
F 1 "Barrel_Jack_Switch" H 7220 941 50  0000 R CNN
F 2 "LIB_BE_PHELMA_CMS:BarrelJack_CLIFF_FC681465S_SMT_Horizontal" H 7500 860 50  0001 C CNN
F 3 "~" H 7500 860 50  0001 C CNN
	1    7450 900 
	1    0    0    1   
$EndComp
Wire Wire Line
	7750 800  7850 800 
Wire Wire Line
	7850 800  7850 900 
Wire Wire Line
	7850 900  7750 900 
Connection ~ 7850 800 
Wire Wire Line
	7850 800  8000 800 
Wire Wire Line
	7750 1150 8000 1150
Wire Wire Line
	7750 1000 7750 1150
Connection ~ 8000 1150
Wire Notes Line
	11200 500  11200 2250
Wire Notes Line
	6500 2250 6500 500 
Wire Notes Line
	6500 500  11200 500 
Wire Notes Line
	6500 2250 11200 2250
$Comp
L power:GND1 #PWR0105
U 1 1 61DC40F2
P 10450 3200
F 0 "#PWR0105" H 10450 2950 50  0001 C CNN
F 1 "GND1" H 10455 3027 50  0000 C CNN
F 2 "" H 10450 3200 50  0001 C CNN
F 3 "" H 10450 3200 50  0001 C CNN
	1    10450 3200
	1    0    0    -1  
$EndComp
$Comp
L Connector:AudioJack3 Jin1
U 1 1 61DC5114
P 900 3050
F 0 "Jin1" H 882 3375 50  0000 C CNN
F 1 "AudioJack3" H 882 3284 50  0000 C CNN
F 2 "LIB_BE_PHELMA:Jack_3.5mm_CUI_SJ1-3533NG_Horizontal" H 900 3050 50  0001 C CNN
F 3 "~" H 900 3050 50  0001 C CNN
	1    900  3050
	1    0    0    -1  
$EndComp
$Comp
L Connector_Generic:Conn_01x02 Jin3
U 1 1 61DC5CA4
P 900 4300
F 0 "Jin3" H 818 4517 50  0000 C CNN
F 1 "Conn_01x02" H 818 4426 50  0000 C CNN
F 2 "LIB_BE_PHELMA_CMS:Molex_PicoBlade_53398-0271_1x02-1MP_P1.25mm_Vertical" H 900 4300 50  0001 C CNN
F 3 "~" H 900 4300 50  0001 C CNN
	1    900  4300
	-1   0    0    -1  
$EndComp
$Comp
L Connector_Generic:Conn_01x03 Jin2
U 1 1 61DC675B
P 900 3600
F 0 "Jin2" H 818 3917 50  0000 C CNN
F 1 "Conn_01x03" H 818 3826 50  0000 C CNN
F 2 "LIB_BE_PHELMA:PinSocket_1x03_P2.54mm_Vertical" H 900 3600 50  0001 C CNN
F 3 "~" H 900 3600 50  0001 C CNN
	1    900  3600
	-1   0    0    -1  
$EndComp
$Comp
L power:GND1 #PWR0106
U 1 1 61DC8409
P 1100 2950
F 0 "#PWR0106" H 1100 2700 50  0001 C CNN
F 1 "GND1" H 1105 2777 50  0000 C CNN
F 2 "" H 1100 2950 50  0001 C CNN
F 3 "" H 1100 2950 50  0001 C CNN
	1    1100 2950
	0    -1   -1   0   
$EndComp
$Comp
L power:GND1 #PWR0107
U 1 1 61DC99B6
P 1100 3700
F 0 "#PWR0107" H 1100 3450 50  0001 C CNN
F 1 "GND1" H 1105 3527 50  0000 C CNN
F 2 "" H 1100 3700 50  0001 C CNN
F 3 "" H 1100 3700 50  0001 C CNN
	1    1100 3700
	0    -1   -1   0   
$EndComp
Wire Wire Line
	1100 3050 1400 3050
Wire Wire Line
	1100 3500 1400 3500
Wire Wire Line
	1400 3500 1400 3050
Connection ~ 1400 3050
Wire Wire Line
	1100 3150 1500 3150
Wire Wire Line
	1100 3600 1500 3600
Wire Wire Line
	1500 3600 1500 3150
Connection ~ 1500 3150
Text Notes 1450 3050 0    50   ~ 0
Droite
Text Notes 1500 3150 0    50   ~ 0
Gauche
Text Notes 1000 4500 0    50   ~ 0
Ne Pas Relier à GND
Wire Notes Line
	500  2600 2100 2600
Wire Notes Line
	2100 2600 2100 3900
Wire Notes Line
	2100 3900 500  3900
Wire Notes Line
	500  3900 500  2600
Text Notes 1350 3900 0    50   ~ 0
Connecteur d'entrée \nBE PET\n(Supprimer si PI)
Wire Wire Line
	1400 3050 2200 3050
Wire Wire Line
	1500 3150 2200 3150
Wire Notes Line
	500  3950 2100 3950
Wire Notes Line
	2100 3950 2100 5000
Wire Notes Line
	2100 5000 500  5000
Wire Notes Line
	500  5000 500  3950
Text Notes 1350 5000 0    50   ~ 0
Connecteur d'entrée \nBE PI\n(Supprimer si PET)
Wire Wire Line
	1100 4300 1200 4300
Wire Wire Line
	1100 4400 1300 4400
Wire Notes Line
	10200 2800 11200 2800
Text Notes 10200 3700 0    50   ~ 0
Connecteur Sortie PET/PI\nNE PAS Renonmmer\nNE PAS Déplacer
Wire Notes Line
	10200 3700 11200 3700
Wire Notes Line
	10200 2800 10200 3700
Wire Notes Line
	11200 3700 11200 2800
Wire Wire Line
	10450 3100 10100 3100
$Comp
L power:PWR_FLAG #FLG0101
U 1 1 61DF1E2D
P 9400 900
F 0 "#FLG0101" H 9400 975 50  0001 C CNN
F 1 "PWR_FLAG" V 9400 1027 50  0000 L CNN
F 2 "" H 9400 900 50  0001 C CNN
F 3 "~" H 9400 900 50  0001 C CNN
	1    9400 900 
	0    -1   -1   0   
$EndComp
Connection ~ 9400 900 
$Comp
L power:PWR_FLAG #FLG0103
U 1 1 61DF42A0
P 8050 800
F 0 "#FLG0103" H 8050 875 50  0001 C CNN
F 1 "PWR_FLAG" H 8050 973 50  0000 C CNN
F 2 "" H 8050 800 50  0001 C CNN
F 3 "~" H 8050 800 50  0001 C CNN
	1    8050 800 
	1    0    0    -1  
$EndComp
Connection ~ 8050 800 
Wire Wire Line
	8050 800  8000 800 
Text Notes 6500 2250 0    50   ~ 0
Alimentation de la carte\nNE PAS Modifier\nNE PAS Supprimer
$Comp
L Connector_Generic:Conn_01x02 Jin5
U 1 1 61DB366F
P 900 4750
F 0 "Jin5" H 818 4967 50  0000 C CNN
F 1 "Conn_01x02" H 818 4876 50  0000 C CNN
F 2 "LIB_BE_PHELMA:PinSocket_1x02_P2.54mm_Vertical" H 900 4750 50  0001 C CNN
F 3 "~" H 900 4750 50  0001 C CNN
	1    900  4750
	-1   0    0    -1  
$EndComp
Wire Wire Line
	1100 4750 1200 4750
Wire Wire Line
	1200 4750 1200 4300
Connection ~ 1200 4300
Wire Wire Line
	1200 4300 2200 4300
Wire Wire Line
	1100 4850 1300 4850
Wire Wire Line
	1300 4850 1300 4400
Connection ~ 1300 4400
Wire Wire Line
	1300 4400 2200 4400
$EndSCHEMATC
