x,y
0.0,0.1764052345967664
0.1111111111111111,0.6828033305232616
0.2222222222222222,1.0826815514227819
0.3333333333333333,1.0901147237045845
0.4444444444444444,0.5287759423406656
0.5555555555555556,-0.43974793131330975
0.6666666666666666,-0.7710165620318794
0.7777777777777777,-0.9999434738419779
0.8888888888888888,-0.6531094948658954
1.0,0.04105985019383699
