x1,x2,y
-4.881350392732472,-2.003180135969658,0
-21.51893663724195,-33.71200167746521,0
-10.276337607164386,-7.428414157972165,0
-4.488318299689688,9.788238973845313,0
7.6345200661095305,23.606726777000944,0
-14.58941130666561,-6.074853447812131,0
6.241278873730749,34.04052141835906,0
-39.17730007820798,-77.13734275702774,0
-46.366276050102925,-86.39148899378529,0
11.65584811742223,34.46508405132451,0
-29.172503808266455,-55.72931039797106,0
-2.889491975290447,2.9329157752565322,0
-6.804456109393229,4.8935259216556055,0
-42.5596638292661,-68.10646562996155,0
42.8963941802113,101.35239907457273,0
41.28707002984593,100.3373501277505,0
47.97816025596743,101.07941268592741,0
-33.2619845547938,-57.981516237969295,0
-27.815675094985053,-38.72528813303353,0
-37.00121482468191,-52.02156057358064,0
-47.861834223276404,-82.13171710085042,0
-29.91585642167236,-52.7642215697063,0
3.8520637747068136,8.460008999563192,0
-28.052917628645545,-38.34741453293576,0
38.172557413106674,76.54221741392436,0
-13.992102132752379,-18.667227519979868,0
35.66467125909536,84.59277288226026,0
-44.466891704958385,-65.88099686573695,0
-2.184832175007166,-2.13230072419183,0
8.533806000947642,27.216170051102377,0
23.544438789537303,47.69670757182855,0
-27.423368943421664,-46.28146327830357,0
4.384966778345145,24.32571002768516,0
-6.84339488686485,-6.710091068014741,0
48.121019956364485,101.48578865411984,0
-11.763549707587707,-20.634518581998073,0
-11.209572272242141,-7.990638443975737,0
-11.69339968747569,-6.005049227334229,0
-44.37480785146242,-71.95068718802929,0
-18.182029910348348,-12.642534302684012,0
14.049209942621403,28.166000232580373,0
6.296804620065856,28.773525587482613,0
-19.763119592726483,-24.516433258011975,0
43.97745283707302,102.67339592340323,0
-16.676671544566773,-9.284085093127484,0
-17.063786961815936,-33.70578208938088,0
28.96174389261591,75.33554855276807,0
37.10737023451467,94.55670671157593,0
18.457164907581614,49.65950973070283,0
13.628922905737738,35.606967551395705,0
-7.019677041787965,5.731649997109194,0
6.139848653767963,14.710770448346542,0
-48.83738380592261,-86.62387666859709,0
39.79551892519719,92.58984721466534,0
29.11232439051653,75.57355905439675,0
33.86904821150037,70.01023972381098,0
-15.310832546539842,-24.92767755463316,0
24.670839746021787,59.599218559296716,0
3.3689227143693685,22.320212254242,0
25.557440799839725,73.28890113011488,0
34.10304163544803,83.67673747693047,0
38.962485883569485,81.26150854051232,0
-15.632958946527339,-6.751414573372617,0
36.18170486513862,94.15805309916456,0
30.34176383199465,73.2515466926224,0
13.127482933903586,49.313665412723,0
-32.09932298479352,-50.66412612565864,0
40.289872420693875,103.66239653861683,0
-33.794490749880396,-46.84154728467721,0
40.39015921060369,104.98747867856481,0
-47.64594650133958,-72.2973227332252,0
3.134879835229839,7.170605106173914,0
-47.676108819033715,-90.98291753404393,0
-10.484551974504598,-11.240737021479552,0
-23.92635793983017,-24.049148447274817,0
46.08122077456793,99.6631645360341,0
21.719303742359042,47.45029858190811,0
37.98034387868311,98.11830440953021,0
20.385980247785508,51.93182088265109,0
38.12722810457559,98.95134606800934,0
18.201682060602398,40.40912577920838,0
8.573700548533004,33.67533888476849,0
43.58525036512157,98.17709455098043,0
-19.24721193700198,-36.582254648246824,0
-6.660145420657514,4.091287774997486,0
23.46105090605546,53.10707070058976,0
-2.3248053466699687,-3.6592226288519942,0
40.60594892415583,82.71050530455099,0
-7.594649555617927,-13.662335684566171,0
-42.92961975762141,-63.16591557811684,0
18.143104754867633,54.78330745546279,0
-16.741037996368163,-11.03051706239295,0
36.82021375956079,90.4549853015346,0
-21.632720411856553,-30.041942597941027,0
21.05939070527989,49.72994051924423,0
31.680863799288318,88.31078388179347,0
-8.651293481008317,-8.247860488531899,0
47.98924538125065,107.74471449284903,0
-32.894002921736316,-56.33187647038609,0
49.530452380745295,123.54907799487705,0
-17.781653679623005,-31.196847724370866,0
22.999202680783515,54.19810538426902,0
-23.519402212259493,-30.030087774143947,0
-46.21885451174383,-90.85751856502189,0
25.124685648004196,65.43060564629691,0
-7.615733441783689,-3.2903043116569766,0
-9.204193127183899,-11.308386835315272,0
-7.225190579087339,-8.490049135073228,0
27.691836735938168,68.24649205434525,0
-45.2749011516985,-81.35161278997097,0
5.287462138237267,21.987921558040917,0
-34.64086724711278,-60.844799950119565,0
-19.947927531750437,-15.633512723601434,0
20.256304914486634,43.84859562261337,0
-31.37978197024772,-60.339465111036084,0
10.349425915301538,29.283645050375977,0
-38.11031971111616,-61.44496690047004,0
-8.12728726358587,0.2248372690789644,0
-38.173536185485275,-66.4156536917695,0
-19.25315900777659,-13.5243681674989,0
-22.525427981964057,-36.25353105910205,0
-0.13243819267022872,17.770290313658354,0
-45.608363472322395,-75.27715958137497,0
-14.399019922963745,-8.471693264740974,0
7.61449514418203,39.634631874709555,0
-10.639321412792434,0.9661985855536379,0
48.080680169066646,115.27540969707601,0
19.84251833254507,57.14124861054741,0
-16.01735374926851,-23.647253256639527,0
20.992239278955594,45.67661801307887,0
-11.801542899884154,-22.037185723273065,0
7.123129905423383,20.29380241588389,0
36.452593577754975,83.71222418504242,0
20.171767404396924,53.39344164954341,0
-6.996491070126488,5.334106711118814,0
-9.087276124817322,5.793970826780182,0
-7.432524884957878,-11.932037760295481,0
-15.320081985713358,-27.965060466581928,0
-15.210327000168888,-15.678285924999008,0
6.858156456602607,32.351264761887535,0
-39.6546595851063,-58.10555966153798,0
13.243812995210348,49.88342799584041,0
6.4135074734373205,37.41267100339069,0
-39.192335501567214,-68.38962869752129,0
-30.619398904608573,-51.73041822102782,0
-20.38885835403663,-37.08249979064145,0
39.97731126876989,97.07798350462876,0
-41.94826137446735,-67.47747378791377,0
-21.424129954911137,-21.296695013542095,0
-49.88470065678665,-97.33795144388228,0
35.05516953420063,82.55476176403481,0
-36.812605736821425,-59.09816323184127,0
33.750706532362514,73.54033906572299,0
-11.55595642838442,-18.886277703539808,0
37.61800171505585,96.72552434060223,0
-34.80082293222344,-68.13827280855791,0
-30.73189587250107,-49.69826914705032,0
-6.910073861459331,-10.92429769039653,0
9.281670277400032,29.98980958808425,0
43.08330045448619,110.66565906753011,0
-19.742877314456365,-28.893095792525912,0
4.645731732193113,30.71958640200041,0
-22.205559947034786,-41.47823078948972,0
-36.63823259286292,-66.49516326667924,0
-47.552150500288576,-85.00948248389379,0
-35.580334239261106,-61.16536497828894,0
48.8285915814998,114.44177012975342,0
14.002193552163611,36.62234028871491,0
-22.9990562424058,-28.153940774561192,0
32.83703227385595,81.65373702834671,0
-2.1036606204129313,5.771707390543465,0
44.566201166074634,99.92640552350726,0
30.000347510359994,75.363887515978,0
48.1478205539386,98.04669586149332,0
-29.36977033574206,-38.179372212591865,0
27.607531193961986,71.5505914157649,0
15.464831930309728,49.088225471065336,0
-42.808129346559085,-72.1931836660584,0
-20.441440192353284,-38.12095260991295,0
46.81610704686921,103.75810442616218,0
33.53058435020873,77.19550827163135,0
-12.147840149976354,-16.269605548872285,0
-7.722858860416757,-14.69695959821478,0
26.21071786254914,70.85279179001022,0
-43.42139979247938,-84.09818813339623,0
-11.396595596589599,-7.635487867052069,0
-3.5632803024958335,10.453876806688726,0
-8.990997635457099,-2.1123371975718293,0
-23.01220295167697,-22.045849603904564,0
18.805500452039816,40.1934547812081,0
10.17789377839081,42.034966534411595,0
29.015625102487785,58.7610060761984,0
31.380699411966383,76.13432019710987,0
-44.437238998393354,-78.76838754830524,0
-23.95507950492876,-34.805562500013565,0
0.9541191382432928,11.03573520298683,0
27.258537202667675,59.28124727883705,0
24.564351822960706,49.60677608213866,0
44.197083967612436,101.34791328000424,0
6.55833744418792,34.186096455496894,0
18.820411800589742,46.971222494799335,0
-19.634348881545947,-33.69710231271739,0
12.224816070751906,26.462932228299913,0
32.03963224403652,66.21203756604062,0
47.53212716086688,100.59916547905306,0
43.27503685367514,89.05042523038915,0
-17.939277349856724,-29.252562240601396,0
4.630315544395472,10.914367641714811,0
-3.6579211108722234,-5.675720541496306,0
-39.667129304034205,-57.927354117498865,0
-49.03389473967043,-94.01478296162003,0
28.310301560152606,70.61266326589141,0
-16.307820310010072,-13.27925200879438,0
23.667762326284937,58.74576378604654,0
47.93490005342713,99.7040220533379,0
-25.837865383614144,-46.68582721422543,0
17.998284917753217,46.82117499253595,0
11.653610582810202,36.5130733950838,0
-8.831711355360575,-8.927415409507779,0
-33.10484552361905,-46.67270104137156,0
-12.898184359114872,-7.020827496819784,0
-37.26506554473953,-51.34983590515111,0
22.645796518436423,46.01540676254686,0
-29.804683391256376,-37.21708450225766,0
31.43640556940478,72.68703085036333,0
-45.27916569719446,-68.59901900988906,0
-18.748827638781535,-20.22803587364983,0
28.449232288644154,81.58218350413752,0
-44.73705904889242,-70.49205680486814,0
-23.085580677015784,-37.0575457041119,0
24.60583574049742,61.73825080186364,0
28.668802263251802,66.74733340636239,0
-1.8200713930663284,5.482653114398296,0
47.433728194546845,101.39006887362018,0
29.25299245588906,70.90524229611486,0
7.531453124849378,32.10640487643279,0
12.583001966577442,32.09951071578597,0
3.6424575635189314,20.39441040396836,0
22.23712937052681,47.408766095317546,0
-8.678434645816878,-13.360737120278975,0
-36.385560592323145,-71.60096231684157,0
38.24681440379669,100.76191487685921,0
-1.7379107154114166,-3.3793126430663056,0
36.793189365484665,78.05087793241074,0
-21.68596811925937,-28.050267410593932,0
10.394029719270627,22.822299409873885,0
-6.542131185850899,8.96315020571901,0
31.67201637859214,81.33453670324148,0
35.51522406566228,95.19019741727189,0
1.1943719351045416,15.079632551228205,0
14.438726215004436,36.387544508971054,0
-44.04319452528131,-74.34887473068083,0
-26.532525380696526,-29.794582828943724,0
-24.866361985054724,-36.71368803906293,0
-40.371973974593345,-74.06377215262873,0
41.65775645579814,105.25048264094927,0
-5.219246992240656,-1.1405252716697785,0
-8.44760689557689,-16.8606300411788,0
-46.19363785472291,-86.19515014713792,0
20.785247320745114,49.52633237091679,0
25.91712200845532,73.3036807227082,0
39.97060577345022,91.40379072356156,0
48.35703704085258,107.82875627698769,0
-42.95293167921905,-77.50330669844091,0
-16.99165465909101,-11.966356242005034,0
-28.515291202313776,-33.40491298111777,0
21.82698942460509,68.45123707807592,0
-8.64101661863267,-7.8635015632406695,0
43.60447338790189,111.36263291648307,0
1.4372404065377111,22.671470053847955,0
-47.74951397444468,-78.6067992577827,0
-37.65052453165907,-69.17881207781566,0
16.18410481631544,37.779641156236124,0
-46.15701545414986,-88.16283529526856,0
26.829837352879547,76.72858996139323,0
-44.93188224156815,-82.51184792355714,0
-44.137770470649855,-76.94818480507774,0
-29.920258735239173,-47.49157162079776,0
-13.044793686679114,-6.635297487101873,0
-37.428796662494705,-53.751719286163805,0
20.697971549220327,44.87276062715598,0
-34.89435553129182,-59.116102057306804,0
-11.787669191752379,-2.503966187618328,0
48.67631422411005,117.80346109211607,0
15.276648206778042,33.11364037486649,0
35.1859139051835,74.28141153206607,0
-48.182938981825316,-88.76091067366544,0
2.1629692960011937,6.209915319085896,0
0.26086345013373347,11.138301971282289,0
-13.947251639872363,-25.20406065100518,0
13.14153938703825,40.48851861582263,0
36.309972831440106,78.78386915815912,0
-32.21177331942455,-49.512720005108534,0
31.015208809724204,64.96855869203935,0
-1.1318982546456056,22.133300201172123,0
27.568297102526074,78.45062430148566,0
40.215551550596594,90.22602656530984,0
-36.219151742168336,-66.38383863118453,0
-47.291948902313024,-88.32394248328673,0
-46.08346580630001,-80.08209323254022,0
-40.6555499221179,-80.31127979671787,0
-27.404733269863883,-38.81683888784959,0
16.685484797135807,43.578542302765236,0
41.88986100120032,93.21488631712283,0
9.27588285861927,38.7858900044685,0
26.776585782905727,71.2790580703937,0
36.7512365242017,97.3608184332207,0
44.657281821317476,98.11296965502721,0
-22.55943642105788,-22.680303725880627,0
48.857254137496895,116.96368793124601,0
-27.05807485027762,-45.18053341068742,0
35.30533545996249,86.15230683125642,0
42.047791741324424,91.30983242394123,0
41.03969657613946,103.93939107914998,0
-17.204780735391438,-31.598878540475095,0
25.463279014715525,56.237417061782075,0
7.946053331990157,20.46793896597834,0
-5.736879132391692,-1.3981082046761681,0
-36.055117382879374,-53.47941076495552,0
-22.70442627113283,-32.23616631596116,0
22.967209476128538,58.12632704071227,0
36.85172007088724,73.71708926419937,0
44.4625679578802,99.56017904963677,0
19.84013655190575,41.269117474715465,0
23.788185076032175,52.782701455101446,0
4.385943319952034,32.08173511391642,0
-18.328133554768044,-31.271312000955135,0
-19.562544563885723,-17.666648161914885,0
21.648115341783335,63.368564972600026,0
12.007304409987952,27.993264743531977,0
31.884903826309696,78.91260658437636,0
-28.854551230651865,-54.8175556636784,0
44.31519235667597,106.82758867258973,0
-19.699724172498733,-23.4628914106923,0
-27.869539594110336,-35.44061514594519,0
-27.74075618487531,-43.49689863502091,0
24.057743565464506,70.98706432676359,0
12.61868620674386,26.471096083198713,0
-8.759963519638902,-10.197712913602437,0
22.717809757553297,63.311934451735766,0
12.914720078211126,36.28217045012227,0
30.294571981436036,64.91292781965097,0
4.0144116243992585,10.709091884512167,0
45.538769874588596,111.51101753571773,0
-29.979588457061794,-48.130602452482485,0
42.30435530133673,106.66580240065113,0
-1.883514883152607,14.565198591612937,0
19.31899004548039,48.881135231729374,0
-7.754294883137547,-6.170814412383002,0
-45.943334083342506,-78.99570950040372,0
-14.55702444560039,-6.8875500614575635,0
46.46375642445091,111.359477341756,0
6.959756049193878,14.048336205113337,0
-1.0016852318250216,15.350575820578097,0
-3.6177494703452027,15.752186231955111,0
-18.139251060383785,-18.51710813315528,0
22.240390226823394,48.90592499283419,0
37.11394345336798,86.31584009242243,0
10.732432345290569,24.972765138666624,0
-45.64057227959488,-82.30626260069896,0
31.286910824915527,86.00174769834399,0
-40.398395492823695,-57.714158296679685,0
-4.380595007732637,-1.6902687110632018,0
4.308857835423417,17.108491775001813,0
-38.20414102298896,-61.40296034269558,0
4.139603823141414,32.35914002779233,0
-22.41676366115432,-41.13849397067388,0
10.097467829689798,26.617851751546322,0
-40.404439290095766,-58.96995789792224,0
-19.00250201912273,-25.707698245536847,0
-19.96220542505168,-17.450383544427563,0
17.227959844288108,39.093867126655624,0
-25.677864273688925,-38.03901386059383,0
-13.606105544714133,-19.055470273193954,0
25.997972662029046,59.909509321369995,0
33.94611775147436,79.0641596016037,0
-29.639147451733166,-48.45135867593462,0
-45.91666030352225,-82.89964861509564,0
4.186117273995713,31.24650380588189,0
-9.09841653236849,0.09677157108534118,0
-35.772264419355466,-53.35585405542269,0
4.277654664614296,15.803145569027478,0
-45.18744768327362,-75.93215975862623,0
-7.575116204487244,4.3292534235713624,0
-32.07671207013149,-44.26366492668266,0
-40.88437184127383,-73.15548216368985,0
-31.552381876856884,-43.83294483949757,0
34.058553655104404,86.51445473040214,0
-12.889843906170043,-22.24202567179258,0
10.15657413803229,41.96178499022651,0
43.72870479766543,98.49044634984114,0
7.5967748110158055,27.353810844248247,0
24.13159331105923,59.472416094568395,0
-34.90383084285108,-55.61151164876447,0
46.66953734533038,108.86830587483713,0
-45.898272186347356,-79.34205522862112,0
14.463115152807035,50.59594388709146,0
14.329310959745712,44.35199082437353,0
48.36714973162921,106.76999819589642,0
31.476767476381607,73.37082887548098,0
9.874049919639127,40.01906521750204,0
-42.9291417302714,-77.15348489187978,0
40.03850697787287,85.36338385030608,0
-44.530153347907955,-87.57572699567118,0
-36.94885305466322,-51.997034911312085,0
4.583760309244823,32.1311818982484,0
17.329911823173994,37.66282820043489,0
26.725587072094314,61.8130176815915,0
-11.446470647687434,-18.508639557493773,0
46.69254085244944,96.28254342554587,0
48.43939355531718,119.37545568563512,0
7.120427750176219,15.662786978986325,0
43.19259260252798,110.89732679178113,0
24.80590117539071,52.023073868216024,0
27.883908465391617,77.35458316062288,0
24.680880627714807,63.52441393015868,0
36.89447687847422,82.98689095239527,0
48.79637771023457,106.1513148360981,0
38.45157028612519,95.8372441531931,0
-11.848025951274785,-15.83171952744239,0
-47.425621281805036,-78.41826964818152,0
-49.03450015608939,-85.13584822427678,0
9.094590462693844,30.31332205433945,0
33.704557395339464,89.93816905690797,0
-13.876175736652932,-13.886225007799375,0
0.969465345126288,22.61047076646995,0
-48.940977728443144,-79.74261710434905,0
43.46957928482198,87.90308972111892,0
-28.32344383138131,-37.31913635012714,0
21.160150266850607,47.74205678597723,0
25.8581379923426,74.29501715597448,0
-16.25045715326759,-31.427809541314378,0
25.393681500903554,59.11416386366508,0
-16.585911755918772,-30.678499830968693,0
-1.730851720228877,8.42802448666334,0
7.591101156415071,35.682763209573935,0
-5.468780866141898,-3.4828777407071945,0
21.294848008037025,46.36306844885009,0
-20.657470627297897,-33.058265362173316,0
8.514313066643595,37.37562968130309,0
13.945443951410773,31.40048684780522,0
-32.86569145557378,-60.04732168421002,0
-42.496691195319215,-83.27208327830408,0
45.399268911270305,108.4412889222808,0
26.737300717023448,63.35543252245532,0
15.148063050743673,38.06712553007024,0
-31.496647937024733,-45.027636115520664,0
-48.54914276432976,-88.69884697015314,0
-46.89717046703518,-75.60005910370991,0
-40.49483455499269,-60.609684227127545,0
20.34437349359701,46.13031807363748,0
-49.20112434144741,-74.05678126174524,0
25.057995894354878,54.174940486526424,0
39.40938451177678,86.08979168997212,0
-45.09526110553941,-85.69563994024027,0
26.65797445319037,61.953590315289105,0
-18.976826507775044,-25.952130820031197,0
44.16436410194113,101.38312492893525,0
-23.070909912747624,-24.801668768088447,0
-38.17202123338397,-54.107844746371285,0
22.75631045340375,51.01521742633016,0
12.094310392257142,39.760971589158096,0
12.570381667908393,27.928164768284674,0
-24.878825754013306,-38.283405003474904,0
26.219275746096116,60.49688994335769,0
32.8146900952357,73.54189882681155,0
5.07083513122619,22.206276305254903,0
19.55315926226805,57.352009412767785,0
-33.91891222586524,-66.10825798192074,0
26.225817398436124,74.43096823905736,0
-0.23894574892614173,17.892452867911743,0
-44.258359969793034,-84.10423521735956,0
-13.399769774466073,-3.320516821747887,0
-36.72894054624648,-60.80007549190824,0
-44.02096893547673,-63.04672341802933,0
-25.0764861886352,-45.22148551975196,0
-19.95750602247513,-26.542307085370226,0
-46.79655666042271,-86.33691225684721,0
-49.440078964767935,-91.27581899480471,0
4.817831733024036,24.412297986897826,0
42.913022181579166,108.86902103492916,0
20.720596855948116,61.57279010137561,0
34.764529431226954,87.62759382498706,0
8.251362520398821,30.4820695933402,0
36.8710671526744,96.79959689703499,0
-10.411780402088198,-8.514525636904292,0
11.719194084214593,45.284192626797136,0
-39.538588428821,-58.22763576072621,0
-46.77946717985019,-88.2130506896607,0
-4.688490166942216,9.903656240263324,0
22.517643013240342,45.339564950062154,0
-9.223041876183679,-10.37534531366517,0
-39.67611582244098,-73.61304552758321,0
9.326665416425172,31.32490479503318,0
-5.207827669197087,8.005673703625465,0
22.83472323938541,48.111355664963924,0
4.4555850549973,21.78422515841381,0
9.828646462040133,43.11759346643991,0
25.1586534917029,56.03347075797944,0
-0.5866383825308361,15.755251837723932,0
-4.881350392732472,35.059305984064,1
-21.51893663724195,-12.786280883081567,1
-10.276337607164386,21.3429796821018,1
-4.488318299689688,38.74262317414684,1
7.6345200661095305,46.368425932821324,1
-14.58941130666561,22.809214462262034,1
6.241278873730749,55.484593163353324,1
-39.17730007820798,-47.588073948273006,1
-46.366276050102925,-57.12221180218484,1
11.65584811742223,77.1535886455273,1
-29.172503808266455,-13.787014290231529,1
-2.889491975290447,26.907830243639218,1
-6.804456109393229,23.579700338227582,1
-42.5596638292661,-43.7017370120201,1
42.8963941802113,116.31654009211587,1
41.28707002984593,122.86452790003582,1
47.97816025596743,138.1927863978023,1
-33.2619845547938,-30.432022227556793,1
-27.815675094985053,-10.915375182670441,1
-37.00121482468191,-25.171426659559398,1
-47.861834223276404,-59.82781284391192,1
-29.91585642167236,-14.319215336345026,1
3.8520637747068136,53.69468362350717,1
-28.052917628645545,-2.3923277290700646,1
38.172557413106674,125.80201900862444,1
-13.992102132752379,23.224427479245392,1
35.66467125909536,113.58984022909759,1
-44.466891704958385,-54.3000687354322,1
-2.184832175007166,50.52571797397654,1
8.533806000947642,50.30150602786277,1
23.544438789537303,88.87531056293125,1
-27.423368943421664,-23.144410405790662,1
4.384966778345145,62.36620499046078,1
-6.84339488686485,40.436333747481285,1
48.121019956364485,144.22676646282832,1
-11.763549707587707,15.222721675578809,1
-11.209572272242141,13.940415483456325,1
-11.69339968747569,13.245783738474806,1
-44.37480785146242,-55.56726506742297,1
-18.182029910348348,6.781164006221378,1
14.049209942621403,61.643851777779744,1
6.296804620065856,50.51187590396812,1
-19.763119592726483,6.141422713524657,1
43.97745283707302,136.1434959139148,1
-16.676671544566773,-2.7465254735820155,1
-17.063786961815936,6.625325685786628,1
28.96174389261591,104.22660265628531,1
37.10737023451467,125.54588987299216,1
18.457164907581614,78.79744937046529,1
13.628922905737738,81.4879926044176,1
-7.019677041787965,22.60145960496025,1
6.139848653767963,42.6174149732039,1
-48.83738380592261,-55.58094599430182,1
39.79551892519719,115.99388272589484,1
29.11232439051653,108.81759058161231,1
33.86904821150037,103.55741322752854,1
-15.310832546539842,7.144065364202973,1
24.670839746021787,99.12236526752137,1
3.3689227143693685,54.61642672937273,1
25.557440799839725,95.066162516111,1
34.10304163544803,115.82978481896504,1
38.962485883569485,118.39089335638963,1
-15.632958946527339,-1.1331667026879821,1
36.18170486513862,102.64728794308205,1
30.34176383199465,103.46407235333147,1
13.127482933903586,58.337240360782154,1
-32.09932298479352,-32.921758965355615,1
40.289872420693875,134.71766081982457,1
-33.794490749880396,-16.113915508309326,1
40.39015921060369,114.58099910144662,1
-47.64594650133958,-65.27528753792404,1
3.134879835229839,59.81145455520359,1
-47.676108819033715,-58.39408518006457,1
-10.484551974504598,13.678336122378242,1
-23.92635793983017,-0.5650131838719545,1
46.08122077456793,124.88503502016901,1
21.719303742359042,80.0548474347881,1
37.98034387868311,130.33805476266738,1
20.385980247785508,86.75852985742128,1
38.12722810457559,119.27140099621502,1
18.201682060602398,76.35132949207824,1
8.573700548533004,66.50992496917107,1
43.58525036512157,120.69443764333548,1
-19.24721193700198,15.689021176920598,1
-6.660145420657514,38.20778436032964,1
23.46105090605546,92.36352637634201,1
-2.3248053466699687,26.423044066724017,1
40.60594892415583,128.73328908450512,1
-7.594649555617927,37.642809410901165,1
-42.92961975762141,-42.74481282827717,1
18.143104754867633,75.14183005541685,1
-16.741037996368163,-0.47514236824958633,1
36.82021375956079,122.51295512256078,1
-21.632720411856553,8.860105456582048,1
21.05939070527989,74.625075012456,1
31.680863799288318,112.33634146738518,1
-8.651293481008317,13.123925194460805,1
47.98924538125065,150.15486371443177,1
-32.894002921736316,-20.411555327595227,1
49.530452380745295,142.8718812362814,1
-17.781653679623005,1.8354384804771842,1
22.999202680783515,99.23069715081161,1
-23.519402212259493,-10.391163741099211,1
-46.21885451174383,-41.734043693070284,1
25.124685648004196,104.87708827943669,1
-7.615733441783689,34.35344925430277,1
-9.204193127183899,24.566361755292995,1
-7.225190579087339,17.201475438117118,1
27.691836735938168,97.19401820115316,1
-45.2749011516985,-49.593403629104415,1
5.287462138237267,45.644825306149414,1
-34.64086724711278,-28.69204357636795,1
-19.947927531750437,-0.9519079614924078,1
20.256304914486634,74.60471635776447,1
-31.37978197024772,-21.725210357183286,1
10.349425915301538,57.2688507387153,1
-38.11031971111616,-33.169078905175716,1
-8.12728726358587,14.624426965733115,1
-38.173536185485275,-23.691286876288448,1
-19.25315900777659,11.902789622443226,1
-22.525427981964057,-1.2363226511654997,1
-0.13243819267022872,51.03033818359062,1
-45.608363472322395,-37.15685009937478,1
-14.399019922963745,3.965017505389023,1
7.61449514418203,60.99978549860916,1
-10.639321412792434,33.671207197806595,1
48.080680169066646,150.85858957147144,1
19.84251833254507,84.76811147235875,1
-16.01735374926851,1.1658142627333996,1
20.992239278955594,86.5642993326744,1
-11.801542899884154,6.448530089592234,1
7.123129905423383,49.21904317751826,1
36.452593577754975,126.80826614450895,1
20.171767404396924,78.60454912386494,1
-6.996491070126488,31.96677050417074,1
-9.087276124817322,18.846935116171423,1
-7.432524884957878,38.83049740787398,1
-15.320081985713358,17.573804277310455,1
-15.210327000168888,7.820624939197538,1
6.858156456602607,63.51034844271449,1
-39.6546595851063,-46.60518105830416,1
13.243812995210348,66.29559949205718,1
6.4135074734373205,48.35746814016445,1
-39.192335501567214,-31.291509821233273,1
-30.619398904608573,-28.677640764918888,1
-20.38885835403663,-0.8520709010064049,1
39.97731126876989,116.87086579276952,1
-41.94826137446735,-41.237949765839595,1
-21.424129954911137,-4.100817897225301,1
-49.88470065678665,-52.10913687189802,1
35.05516953420063,100.72476467607541,1
-36.812605736821425,-27.775538440995163,1
33.750706532362514,103.26569530707053,1
-11.55595642838442,13.605812862152394,1
37.61800171505585,125.24239351969979,1
-34.80082293222344,-15.712436014936358,1
-30.73189587250107,-23.550036494324974,1
-6.910073861459331,36.84998403630823,1
9.281670277400032,51.16311150408089,1
43.08330045448619,132.01614223415697,1
-19.742877314456365,9.29005285946024,1
4.645731732193113,43.19091166524764,1
-22.205559947034786,-3.761060202330558,1
-36.63823259286292,-20.9587860795013,1
-47.552150500288576,-62.51483941436785,1
-35.580334239261106,-40.70825952348533,1
48.8285915814998,142.42181763919794,1
14.002193552163611,68.89267561760056,1
-22.9990562424058,3.9691187372859673,1
32.83703227385595,118.76045300281456,1
-2.1036606204129313,33.27151987276954,1
44.566201166074634,128.8425052613769,1
30.000347510359994,102.15749717895287,1
48.1478205539386,140.99942761875968,1
-29.36977033574206,-4.143194929443702,1
27.607531193961986,102.64831865867527,1
15.464831930309728,70.66837654425868,1
-42.808129346559085,-49.022066531856616,1
-20.441440192353284,12.732762575846536,1
46.81610704686921,127.02092492145108,1
33.53058435020873,115.06781501303641,1
-12.147840149976354,28.839195332358308,1
-7.722858860416757,31.170921942527453,1
26.21071786254914,92.9977967292513,1
-43.42139979247938,-51.86802608682166,1
-11.396595596589599,16.393691863118985,1
-3.5632803024958335,40.54523463051139,1
-8.990997635457099,28.256360333468223,1
-23.01220295167697,7.174998261605012,1
18.805500452039816,89.282523745564,1
10.17789377839081,70.75955636344082,1
29.015625102487785,110.81752208874464,1
31.380699411966383,99.669827642359,1
-44.437238998393354,-49.63638949329547,1
-23.95507950492876,-8.412811415207088,1
0.9541191382432928,45.919502994231095,1
27.258537202667675,101.22253014390462,1
24.564351822960706,86.29662072193126,1
44.197083967612436,118.88072961795739,1
6.55833744418792,53.09723447982357,1
18.820411800589742,75.35402259003949,1
-19.634348881545947,14.285920212359304,1
12.224816070751906,76.6562581551049,1
32.03963224403652,115.58703144665853,1
47.53212716086688,141.38924834536482,1
43.27503685367514,125.15730282482374,1
-17.939277349856724,7.84267698526917,1
4.630315544395472,59.641257106700266,1
-3.6579211108722234,25.14941699632583,1
-39.667129304034205,-29.307386601685792,1
-49.03389473967043,-67.03829469613783,1
28.310301560152606,107.03112890066411,1
-16.307820310010072,17.573454483976693,1
23.667762326284937,78.61070737328876,1
47.93490005342713,141.54881789340072,1
-25.837865383614144,-9.114403909405858,1
17.998284917753217,70.2420574147993,1
11.653610582810202,57.0166946075548,1
-8.831711355360575,31.66805544095443,1
-33.10484552361905,-22.017372326316995,1
-12.898184359114872,28.778609654683567,1
-37.26506554473953,-19.973936657270453,1
22.645796518436423,100.10826787347952,1
-29.804683391256376,-26.643978823368602,1
31.43640556940478,116.32921456290862,1
-45.27916569719446,-54.44409116887485,1
-18.748827638781535,3.9576512164022315,1
28.449232288644154,105.83362847283146,1
-44.73705904889242,-54.38359479585404,1
-23.085580677015784,-2.0133712151733203,1
24.60583574049742,83.85709018664473,1
28.668802263251802,89.95600719353594,1
-1.8200713930663284,29.273822524607308,1
47.433728194546845,133.80843226029916,1
29.25299245588906,88.6223558327077,1
7.531453124849378,55.684254279741,1
12.583001966577442,71.77093156018361,1
3.6424575635189314,47.32711975213758,1
22.23712937052681,76.6191237540495,1
-8.678434645816878,14.210352258957258,1
-36.385560592323145,-35.81820836552475,1
38.24681440379669,110.7264460711834,1
-1.7379107154114166,50.6515528996264,1
36.793189365484665,107.36713435532145,1
-21.68596811925937,6.764624696606173,1
10.394029719270627,65.44075798206987,1
-6.542131185850899,31.14791062790556,1
31.67201637859214,106.1460506552789,1
35.51522406566228,125.32452503417333,1
1.1943719351045416,41.48486324750003,1
14.438726215004436,78.57534620385579,1
-44.04319452528131,-44.204036363888626,1
-26.532525380696526,-13.1742090707499,1
-24.866361985054724,4.153924362535076,1
-40.371973974593345,-35.78604871506951,1
41.65775645579814,116.28843646524662,1
-5.219246992240656,29.999986040440103,1
-8.44760689557689,32.64432940088641,1
-46.19363785472291,-45.04360012846547,1
20.785247320745114,94.47900288740459,1
25.91712200845532,88.31867862044865,1
39.97060577345022,128.89605445574603,1
48.35703704085258,138.2109542665682,1
-42.95293167921905,-41.56561968426771,1
-16.99165465909101,19.89285770697505,1
-28.515291202313776,-2.5484244048981175,1
21.82698942460509,95.19375294734927,1
-8.64101661863267,21.695393955992067,1
43.60447338790189,139.40146766898678,1
1.4372404065377111,48.83971025411075,1
-47.74951397444468,-54.749108437121535,1
-37.65052453165907,-44.407482000806056,1
16.18410481631544,81.62141273742043,1
-46.15701545414986,-49.76139139019689,1
26.829837352879547,103.31438719238562,1
-44.93188224156815,-41.16319449955455,1
-44.137770470649855,-38.436356740090915,1
-29.920258735239173,-22.324238503059174,1
-13.044793686679114,23.930377603332545,1
-37.428796662494705,-31.136435113335224,1
20.697971549220327,83.22909810966924,1
-34.89435553129182,-22.91056321706472,1
-11.787669191752379,6.958628689953951,1
48.67631422411005,129.91054884540995,1
15.276648206778042,67.85773054274414,1
35.1859139051835,124.94658055931299,1
-48.182938981825316,-62.87223349202676,1
2.1629692960011937,42.590846110982646,1
0.26086345013373347,31.798053517565556,1
-13.947251639872363,10.387218727573432,1
13.14153938703825,64.29123593684729,1
36.309972831440106,126.29012493649327,1
-32.21177331942455,-13.294694463956095,1
31.015208809724204,101.59952310051769,1
-1.1318982546456056,28.355429941690005,1
27.568297102526074,105.91237205493661,1
40.215551550596594,126.94450752980669,1
-36.219151742168336,-38.62919139305393,1
-47.291948902313024,-39.68211602937137,1
-46.08346580630001,-59.66109567699695,1
-40.6555499221179,-29.633236304394227,1
-27.404733269863883,-17.45281243648554,1
16.685484797135807,74.25480625240054,1
41.88986100120032,133.66613517180852,1
9.27588285861927,65.4894746170888,1
26.776585782905727,106.99978092691244,1
36.7512365242017,119.03098118491299,1
44.657281821317476,121.75981767961127,1
-22.55943642105788,6.990136238932994,1
48.857254137496895,146.94339639970858,1
-27.05807485027762,-6.31938842822219,1
35.30533545996249,101.95400960376837,1
42.047791741324424,124.00115209919245,1
41.03969657613946,116.2652886387674,1
-17.204780735391438,16.13803623941385,1
25.463279014715525,98.43977359987761,1
7.946053331990157,67.96904659695869,1
-5.736879132391692,42.690619408320714,1
-36.055117382879374,-22.741544410946283,1
-22.70442627113283,9.44697453825339,1
22.967209476128538,91.30366610586455,1
36.85172007088724,104.63168023906067,1
44.4625679578802,119.2814237945178,1
19.84013655190575,78.23286998390623,1
23.788185076032175,98.16316312875279,1
4.385943319952034,60.42525429802234,1
-18.328133554768044,17.36404611103086,1
-19.562544563885723,-7.4970524140509855,1
21.648115341783335,74.41050845825828,1
12.007304409987952,76.84669872915174,1
31.884903826309696,101.39597511169093,1
-28.854551230651865,-13.759417446062912,1
44.31519235667597,143.19150678836968,1
-19.699724172498733,0.6117650234006167,1
-27.869539594110336,-9.092294230474675,1
-27.74075618487531,-15.459523278950986,1
24.057743565464506,97.3203537424985,1
12.61868620674386,68.43024055280937,1
-8.759963519638902,18.41815141038094,1
22.717809757553297,82.21827204656825,1
12.914720078211126,62.28092046988243,1
30.294571981436036,103.8971521693361,1
4.0144116243992585,55.608548649190126,1
45.538769874588596,144.80953725025574,1
-29.979588457061794,-12.606992537049091,1
42.30435530133673,134.13853170173323,1
-1.883514883152607,30.456123130308928,1
19.31899004548039,77.98954571614392,1
-7.754294883137547,24.835915730181558,1
-45.943334083342506,-44.72716241667319,1
-14.55702444560039,8.28325051822106,1
46.46375642445091,130.50981088439346,1
6.959756049193878,52.81674096440946,1
-1.0016852318250216,48.25418157493076,1
-3.6177494703452027,37.20425331039331,1
-18.139251060383785,-4.396570124949208,1
22.240390226823394,76.43693294590851,1
37.11394345336798,113.51006051379844,1
10.732432345290569,70.6296409557351,1
-45.64057227959488,-44.06405889722274,1
31.286910824915527,110.2733805161107,1
-40.398395492823695,-31.616539334294966,1
-4.380595007732637,28.41762780669296,1
4.308857835423417,52.324122719399035,1
-38.20414102298896,-32.82446603805869,1
4.139603823141414,56.77002017578156,1
-22.41676366115432,9.088236905332518,1
10.097467829689798,57.144684279266244,1
-40.404439290095766,-30.97683676126533,1
-19.00250201912273,8.494259674836101,1
-19.96220542505168,4.581535921483146,1
17.227959844288108,83.82791417226126,1
-25.677864273688925,2.2450831133246325,1
-13.606105544714133,3.7050743573070593,1
25.997972662029046,85.6809478868886,1
33.94611775147436,116.79941629047661,1
-29.639147451733166,-27.18351108071422,1
-45.91666030352225,-48.93022808851717,1
4.186117273995713,43.8687539640316,1
-9.09841653236849,18.66055953133181,1
-35.772264419355466,-23.998516765100526,1
4.277654664614296,39.31012866094638,1
-45.18744768327362,-38.541909668999644,1
-7.575116204487244,25.96174147483226,1
-32.07671207013149,-21.593591792585457,1
-40.88437184127383,-38.26754459020537,1
-31.552381876856884,-16.96615638922642,1
34.058553655104404,106.73852197577752,1
-12.889843906170043,6.747999451747198,1
10.15657413803229,58.27262169271899,1
43.72870479766543,121.66096254590137,1
7.5967748110158055,59.09687910829346,1
24.13159331105923,86.21390239612813,1
-34.90383084285108,-15.855982235866286,1
46.66953734533038,147.4824316401678,1
-45.898272186347356,-46.293397358488676,1
14.463115152807035,74.36366199729622,1
14.329310959745712,83.29308603366907,1
48.36714973162921,148.91637824413806,1
31.476767476381607,112.08028368171672,1
9.874049919639127,57.587865132845785,1
-42.9291417302714,-46.719807757590885,1
40.03850697787287,115.10868309976738,1
-44.530153347907955,-46.88160352288155,1
-36.94885305466322,-19.138493055836946,1
4.583760309244823,61.97129444377937,1
17.329911823173994,67.61855949683472,1
26.725587072094314,84.08093137645128,1
-11.446470647687434,29.573000414831785,1
46.69254085244944,136.81433490361655,1
48.43939355531718,131.88353431584576,1
7.120427750176219,61.08218723996832,1
43.19259260252798,132.49076465330145,1
24.80590117539071,82.6639425216931,1
27.883908465391617,92.25782276822372,1
24.680880627714807,80.86371036326106,1
36.89447687847422,109.035465603702,1
48.79637771023457,130.9003972917957,1
38.45157028612519,111.73404788411428,1
-11.848025951274785,23.440626745278355,1
-47.425621281805036,-63.61374895708338,1
-49.03450015608939,-65.52263493097337,1
9.094590462693844,51.54352187734488,1
33.704557395339464,105.32264281463227,1
-13.876175736652932,9.716406297992659,1
0.969465345126288,38.31552532316856,1
-48.940977728443144,-49.118539121075884,1
43.46957928482198,141.88972826359648,1
-28.32344383138131,-13.297439572042727,1
21.160150266850607,95.92536848154977,1
25.8581379923426,91.63152878783681,1
-16.25045715326759,0.1661468635326564,1
25.393681500903554,91.00670873855304,1
-16.585911755918772,4.231370823529788,1
-1.730851720228877,38.8734706167717,1
7.591101156415071,61.60829423574072,1
-5.468780866141898,30.58869374652641,1
21.294848008037025,95.96870881801968,1
-20.657470627297897,10.804179302888702,1
8.514313066643595,64.57806601244212,1
13.945443951410773,70.13301071193527,1
-32.86569145557378,-32.43920086578614,1
-42.496691195319215,-45.0680407211976,1
45.399268911270305,138.40857630756994,1
26.737300717023448,90.59673944789017,1
15.148063050743673,62.89582804007286,1
-31.496647937024733,-10.295834436283762,1
-48.54914276432976,-49.3720152832709,1
-46.89717046703518,-48.412430268192935,1
-40.49483455499269,-31.17719646976247,1
20.34437349359701,91.57989792678092,1
-49.20112434144741,-56.315773728619234,1
25.057995894354878,102.14569807394575,1
39.40938451177678,131.7292442910812,1
-45.09526110553941,-53.40174482545928,1
26.65797445319037,98.5045829011506,1
-18.976826507775044,5.21094770496164,1
44.16436410194113,131.7773726826798,1
-23.070909912747624,7.299757523618805,1
-38.17202123338397,-38.71432489944222,1
22.75631045340375,100.0984703626719,1
12.094310392257142,76.74190115462008,1
12.570381667908393,66.60883555115436,1
-24.878825754013306,0.6786800824275439,1
26.219275746096116,101.66472635019575,1
32.8146900952357,112.57675443093443,1
5.07083513122619,48.13751749703124,1
19.55315926226805,74.01759332005996,1
-33.91891222586524,-21.04963203258653,1
26.225817398436124,103.52596720689934,1
-0.23894574892614173,29.928428219081958,1
-44.258359969793034,-42.44663555687327,1
-13.399769774466073,14.272286066623167,1
-36.72894054624648,-21.005687214318364,1
-44.02096893547673,-50.00511459959833,1
-25.0764861886352,-8.298352070679858,1
-19.95750602247513,2.9541655559293982,1
-46.79655666042271,-60.082125286569095,1
-49.440078964767935,-51.057850362063206,1
4.817831733024036,60.39757209407206,1
42.913022181579166,117.27377628556484,1
20.720596855948116,78.7259142253188,1
34.764529431226954,100.48017590083036,1
8.251362520398821,70.4163276580037,1
36.8710671526744,120.42135482294438,1
-10.411780402088198,33.28144968219314,1
11.719194084214593,66.72574512671189,1
-39.538588428821,-29.025463760251654,1
-46.77946717985019,-54.19858476270687,1
-4.688490166942216,29.468495480431592,1
22.517643013240342,84.49198145410901,1
-9.223041876183679,28.000469590793347,1
-39.67611582244098,-40.36590286934065,1
9.326665416425172,71.16251712295599,1
-5.207827669197087,44.16621628785971,1
22.83472323938541,76.43010936219596,1
4.4555850549973,43.75175237005701,1
9.828646462040133,52.463542738764914,1
25.1586534917029,81.37640816069188,1
-0.5866383825308361,34.52024806862049,1
