{
    "bc": {
      "top": {
          "type_x": "none",
          "type_y": "neumann",
          "type_z": "none",
          "vx": 0,
          "vy": 1,
          "vz": 0
      },
      "bottom": {
          "type_x": "none",
          "type_y": "dirichlet",
          "type_z": "none",
          "vx": 0,
          "vy": 0,
          "vz": 0
      },
      "front": {
          "type_x": "none",
          "type_y": "none",
          "type_z": "none",
          "vx": 0,
          "vy": 0,
          "vz": 0
      },
      "back": {
          "type_x": "none",
          "type_y": "none",
          "type_z": "none",
          "vx": 0,
          "vy": 0,
          "vz": 0
      },
      "left": {
          "type_x": "none",
          "type_y": "none",
          "type_z": "none",
          "vx": 0,
          "vy": 0,
          "vz": 0
      },
      "right": {
          "type_x": "none",
          "type_y": "none",
          "type_z": "none",
          "vx": 0,
          "vy": 0,
          "vz": 0
      }
    },
    "cti": {
        "beta": 0.01,
        "gamma": 1.0
    },
    "input": {
        "mesh_file": "cube_10.geo"
    },
    "non_linear": {
        "it_max_nl": 1,
        "n_ice": 3.0,
        "non_linear": true,
        "tol_nl": 1.0e-10
    },
    "orientation": {
        "grains": false,
        "ori_file": "none",
        "ori_mesh": "none"
    },
    "output": {
        "out_folder": "./",
        "out_modulo": 200
    },
    "solver": {
        "o_order": "P0",
        "p_order": "P1",
        "u_order": "P2",
        "iterative": false
    },
    "time_step": {
        "dt": 0.25e-1,
        "it_max_c": 2,
        "it_max_c_0": 50,
        "lambda": 1.0,
        "mo": 1.86e-2,
        "nb_t": 200000,
        "no_time": false,
        "tol_c": 1.0e-10
    }
}
