Start: 2022-07-01 11:52:26.779171
SVM  cross validation : 
kernel :  rbf
class weight :  {1: 0.75}
C :  1.0
probability :  False
importing data
start learning
Learning :
 	Train :  ['CI04_US', 'CI06_US', 'CI09_US', 'CI21_US'] 
 	Test :  CI02
Learning :
 	Train :  ['CI02_US', 'CI06_US', 'CI09_US', 'CI21_US'] 
 	Test :  CI04
Learning :
 	Train :  ['CI02_US', 'CI04_US', 'CI09_US', 'CI21_US'] 
 	Test :  CI06
Learning :
 	Train :  ['CI02_US', 'CI04_US', 'CI06_US', 'CI21_US'] 
 	Test :  CI09
Learning :
 	Train :  ['CI02_US', 'CI04_US', 'CI06_US', 'CI09_US'] 
 	Test :  CI21
Learning done
Saving results
Start: 2022-07-01 15:53:45.467459
kmeans  cross validation : 
importing data
start learning
Learning :
 	Train :  ['CI04', 'CI06', 'CI09', 'CI21'] 
 	Test :  CI02
Start: 2022-07-01 15:54:02.038374
kmeans  cross validation : 
importing data
spliting variables for train
start learning
Learning :
 	Train :  ['CI04_sub', 'CI06_sub', 'CI09_sub', 'CI21_sub'] 
 	Test :  CI02
