4.368932038834951181e-01 5.448275862068965303e-01 6.620370370370370905e-01 5.333333333333333259e-01 5.303030303030302761e-01
3.953488372093023062e-01 5.050505050505050830e-01 2.894736842105263275e-01 3.703703703703703498e-01 3.980582524271844558e-01
8.499999999999999778e-01 7.462686567164179552e-01 1.929824561403508665e-01 4.761904761904761640e-01 5.694444444444444198e-01
1.746031746031745935e-01 3.717948717948718063e-01 8.301886792452830566e-01 5.641025641025640969e-01 5.079365079365079083e-01
