2.373930000000000000e+05 6.998000000000000000e+03 1.095500000000000000e+04 4.940000000000000000e+02
2.610940000000000000e+05 4.489000000000000000e+03 2.923900000000000000e+04 1.014000000000000000e+03
2.762030000000000000e+05 1.312500000000000000e+04 1.422000000000000000e+04 1.156000000000000000e+03
2.728940000000000000e+05 4.082000000000000000e+03 1.581900000000000000e+04 9.530000000000000000e+02
2.917420000000000000e+05 1.403300000000000000e+04 2.019200000000000000e+04 1.747000000000000000e+03
