1.691850000000000000e+05 7.520600000000000000e+04 2.370000000000000000e+03 9.079000000000000000e+03
1.900780000000000000e+05 7.550500000000000000e+04 1.174200000000000000e+04 1.851100000000000000e+04
1.764530000000000000e+05 1.128750000000000000e+05 2.942000000000000000e+03 1.243400000000000000e+04
2.284260000000000000e+05 4.855000000000000000e+04 8.193000000000000000e+03 8.579000000000000000e+03
1.739530000000000000e+05 1.318220000000000000e+05 3.449000000000000000e+03 1.849000000000000000e+04
