5.145631067961164984e-01 6.482758620689654805e-01 5.277777777777777901e-01 5.500000000000000444e-01 4.949494949494949725e-01
4.342105263157894912e-01 6.250000000000000000e-01 3.076923076923077094e-01 3.928571428571428492e-01 3.923076923076923017e-01
8.249999999999999556e-01 5.970149253731342753e-01 6.315789473684210176e-01 5.238095238095238360e-01 7.083333333333333703e-01
3.174603174603174427e-01 6.923076923076922906e-01 4.905660377358490587e-01 5.641025641025640969e-01 3.730158730158730229e-01
