6.648454396117076115e-01 6.205522979081079527e-01 6.097311810716181668e-01 6.019527686860512983e-01 6.174138603933356784e-01 5.916455604287015335e-01 6.105450518253082715e-01 5.864713360127564723e-01 5.799577812903333740e-01 5.784163368170501807e-01 5.701645102377075336e-01 5.733190901228226721e-01 5.800020892575785680e-01 5.517599052463255660e-01 5.410799086180427819e-01 5.296310274656256256e-01 5.329958123986363594e-01 5.145828290953579076e-01 5.048897992710408289e-01 4.865457631895706569e-01 4.676529697264898977e-01 4.703253244335330319e-01 4.506934256829186469e-01 4.446740633930931774e-01 4.239528018444326252e-01 4.409810222611688646e-01 4.337844424504697094e-01 4.143181930736123397e-01 3.868960926777811893e-01 3.729989551981182094e-01 3.649252261725282054e-01 3.462156592495672092e-01 3.443537882639297054e-01 3.410688778298395785e-01 3.172092729216698381e-01 3.071367788706171331e-01 2.926736353199133056e-01 2.916655120241266053e-01 2.802182044071141465e-01 2.578156097996237017e-01 2.531832352955100118e-01 2.509009295825926356e-01 2.473993334656358345e-01 2.410380171179582476e-01 2.242937870230782282e-01 2.228127315027355337e-01 2.033455063556229292e-01 1.930913534631073514e-01 2.029363999894244763e-01 2.316878461978811032e-01
6.931471824645996094e-01 6.931471824645996094e-01 6.931471824645996094e-01 6.931471824645996094e-01 6.931471824645996094e-01 6.905272822955559331e-01 6.905272822955559331e-01 6.931471824645996094e-01 6.905272822955559331e-01 6.905272822955559331e-01 6.905272822955559331e-01 6.905272822955559331e-01 6.905272822955559331e-01 6.905272822955559331e-01 6.905272822955559331e-01 6.905272822955559331e-01 6.843243331744752744e-01 6.826675817884247932e-01 6.826675817884247932e-01 6.879073821265121458e-01 6.879073821265121458e-01 6.800476816193811169e-01 6.826675817884247932e-01 6.869442333435190617e-01 6.826675817884247932e-01 6.817044330054315981e-01 7.064011935530037922e-01 6.800476816193811169e-01 6.869442333435190617e-01 6.800476816193811169e-01 7.106778451080979497e-01 7.170353044723641878e-01 6.850179357775326716e-01 6.876378359465763479e-01 6.745383351013578555e-01 6.859810845605258667e-01 6.830916382115462815e-01 6.982719468659368545e-01 7.137218017002632253e-01 7.153785530863137065e-01 6.840547869945394766e-01 6.919144875016706164e-01 7.424256676229937790e-01 6.968847416598221711e-01 6.966151954798862622e-01 7.275149051485390039e-01 7.061316473730678833e-01 7.315220105236974746e-01 7.269758127886672971e-01 7.127586529172700303e-01
6.783783783783783861e+01 7.035135135135135442e+01 7.043243243243243512e+01 7.032432432432432279e+01 6.808108108108108070e+01 7.075675675675675791e+01 6.827027027027027373e+01 7.075675675675675791e+01 7.108108108108108070e+01 7.105405405405404906e+01 7.178378378378378954e+01 7.189189189189188767e+01 6.832432432432432279e+01 7.397297297297296836e+01 7.364864864864864558e+01 7.402702702702703164e+01 7.210810810810811233e+01 7.551351351351351582e+01 7.467567567567567721e+01 7.751351351351351582e+01 7.702702702702703164e+01 7.810810810810811233e+01 7.827027027027027373e+01 7.900000000000000000e+01 8.081081081081080697e+01 7.875675675675675791e+01 7.789189189189188767e+01 8.086486486486487024e+01 8.308108108108108070e+01 8.340540540540540349e+01 8.491891891891891930e+01 8.454054054054054745e+01 8.597297297297296836e+01 8.548648648648648418e+01 8.754054054054054745e+01 8.713513513513512976e+01 8.805405405405404906e+01 8.743243243243243512e+01 8.837837837837837185e+01 8.900000000000000000e+01 9.124324324324324209e+01 9.008108108108108070e+01 8.935135135135135442e+01 8.937837837837837185e+01 9.072972972972972627e+01 9.070270270270270885e+01 9.140540540540540349e+01 9.237837837837837185e+01 9.254054054054054745e+01 9.243243243243243512e+01
0.000000000000000000e+00 nan nan nan 6.756756756756756577e-01 nan 1.351351351351351315e+00 nan nan nan nan nan 1.621621621621621712e+00 nan nan nan 1.572972972972972983e+01 nan nan nan nan nan nan nan nan 4.094594594594594383e+01 3.729729729729729826e+01 nan nan nan nan nan nan nan nan nan nan nan nan nan nan 7.032432432432432279e+01 nan nan 6.994594594594595094e+01 nan nan nan 7.645945945945945255e+01 nan
nan 1.000000000000000000e+02 1.000000000000000000e+02 1.000000000000000000e+02 nan 1.000000000000000000e+02 nan 9.959459459459459651e+01 1.000000000000000000e+02 1.000000000000000000e+02 1.000000000000000000e+02 9.894594594594595094e+01 nan 9.902702702702703164e+01 9.972972972972972627e+01 9.954054054054054745e+01 nan 9.862162162162162815e+01 9.897297297297296836e+01 1.000000000000000000e+02 9.902702702702703164e+01 1.000000000000000000e+02 9.927027027027027373e+01 9.962162162162162815e+01 9.978378378378378954e+01 nan nan 9.764864864864864558e+01 9.929729729729729115e+01 9.864864864864864558e+01 9.927027027027027373e+01 9.945945945945945255e+01 9.943243243243243512e+01 9.945945945945945255e+01 9.959459459459459651e+01 9.932432432432432279e+01 9.945945945945945255e+01 9.900000000000000000e+01 9.932432432432432279e+01 9.956756756756756488e+01 9.943243243243243512e+01 nan 9.897297297297296836e+01 9.856756756756756488e+01 nan 9.937837837837837185e+01 nan 9.975675675675675791e+01 nan 9.772972972972972627e+01
5.931034482758620330e-01 5.931034482758620330e-01 5.931034482758620330e-01 5.931034482758620330e-01 5.931034482758620330e-01 5.999999999999999778e-01 5.999999999999999778e-01 5.931034482758620330e-01 5.999999999999999778e-01 5.999999999999999778e-01 5.999999999999999778e-01 5.999999999999999778e-01 5.999999999999999778e-01 5.999999999999999778e-01 5.999999999999999778e-01 5.999999999999999778e-01 6.206896551724138122e-01 6.206896551724138122e-01 6.206896551724138122e-01 6.068965517241379226e-01 6.068965517241379226e-01 6.275862068965517571e-01 6.206896551724138122e-01 6.137931034482758674e-01 6.206896551724138122e-01 6.275862068965517571e-01 5.931034482758620330e-01 6.275862068965517571e-01 6.137931034482758674e-01 6.275862068965517571e-01 5.862068965517240882e-01 5.999999999999999778e-01 6.275862068965517571e-01 6.206896551724138122e-01 6.551724137931034253e-01 6.206896551724138122e-01 6.413793103448275357e-01 6.275862068965517571e-01 5.999999999999999778e-01 5.999999999999999778e-01 6.344827586206897019e-01 6.137931034482758674e-01 5.724137931034483096e-01 6.137931034482758674e-01 6.275862068965517571e-01 5.724137931034483096e-01 6.068965517241379226e-01 5.793103448275862544e-01 5.999999999999999778e-01 6.068965517241379226e-01
0.000000000000000000e+00 0.000000000000000000e+00 0.000000000000000000e+00 0.000000000000000000e+00 0.000000000000000000e+00 1.694915254237288130e-02 1.694915254237288130e-02 0.000000000000000000e+00 1.694915254237288130e-02 1.694915254237288130e-02 1.694915254237288130e-02 1.694915254237288130e-02 1.694915254237288130e-02 1.694915254237288130e-02 1.694915254237288130e-02 1.694915254237288130e-02 8.474576271186440302e-02 6.779661016949152519e-02 6.779661016949152519e-02 3.389830508474576259e-02 3.389830508474576259e-02 8.474576271186440302e-02 6.779661016949152519e-02 6.779661016949152519e-02 6.779661016949152519e-02 1.016949152542372947e-01 1.355932203389830504e-01 8.474576271186440302e-02 6.779661016949152519e-02 8.474576271186440302e-02 1.355932203389830504e-01 2.881355932203389925e-01 1.355932203389830504e-01 1.186440677966101725e-01 2.033898305084745894e-01 1.016949152542372947e-01 2.033898305084745894e-01 2.711864406779661008e-01 2.542372881355932090e-01 2.711864406779661008e-01 1.694915254237288060e-01 1.186440677966101725e-01 3.728813559322033955e-01 1.694915254237288060e-01 2.542372881355932090e-01 2.203389830508474534e-01 2.203389830508474534e-01 3.050847457627118842e-01 3.898305084745762872e-01 2.881355932203389925e-01
1.000000000000000000e+00 1.000000000000000000e+00 1.000000000000000000e+00 1.000000000000000000e+00 1.000000000000000000e+00 1.000000000000000000e+00 1.000000000000000000e+00 1.000000000000000000e+00 1.000000000000000000e+00 1.000000000000000000e+00 1.000000000000000000e+00 1.000000000000000000e+00 1.000000000000000000e+00 1.000000000000000000e+00 1.000000000000000000e+00 1.000000000000000000e+00 9.883720930232557933e-01 1.000000000000000000e+00 1.000000000000000000e+00 1.000000000000000000e+00 1.000000000000000000e+00 1.000000000000000000e+00 1.000000000000000000e+00 9.883720930232557933e-01 1.000000000000000000e+00 9.883720930232557933e-01 9.069767441860464574e-01 1.000000000000000000e+00 9.883720930232557933e-01 1.000000000000000000e+00 8.953488372093023617e-01 8.139534883720930258e-01 9.651162790697674909e-01 9.651162790697674909e-01 9.651162790697674909e-01 9.767441860465115866e-01 9.418604651162790775e-01 8.720930232558139483e-01 8.372093023255814392e-01 8.255813953488372325e-01 9.534883720930232842e-01 9.534883720930232842e-01 7.093023255813953876e-01 9.186046511627906641e-01 8.837209302325581550e-01 8.139534883720930258e-01 8.720930232558139483e-01 7.674418604651163101e-01 7.441860465116278966e-01 8.255813953488372325e-01
