6.603516480114228759e-01 6.357632468699853101e-01 6.260454537616152448e-01 6.204026313368361523e-01 6.140869378062324691e-01 6.117775790623469767e-01 6.075271495882778039e-01 6.031892011897304062e-01 5.947810206442880610e-01 5.901993770583596755e-01 5.781612898465497974e-01 5.774106403969749834e-01 5.627302885179555902e-01 5.548825377287285310e-01 5.486269658113914760e-01 5.387766645341177663e-01 5.247019602641521674e-01 5.177750802400297170e-01 5.229013528096358998e-01 4.992695679647365936e-01 4.970048543906499527e-01 4.702688121014186318e-01 4.571488062383020079e-01 4.437527161904301631e-01 4.344707481005784522e-01 4.249990294513851796e-01 4.023302845673082384e-01 3.849376485791866642e-01 3.806625697391081697e-01 3.803727440273556026e-01 3.447882030741701853e-01 3.408873219345824879e-01 3.140350321070868311e-01 2.963213485500148514e-01 2.884052058144782049e-01 2.797678985842050325e-01 2.553235892831343112e-01 2.514857702531129724e-01 2.508137466323714371e-01 2.276126847154843202e-01 2.316457683732839057e-01 2.082070486156382405e-01 1.977071992995674543e-01 1.837688831920828436e-01 1.767525756178024710e-01 1.664830752851777229e-01 1.579642957120096225e-01 1.558668294634606433e-01 1.433647089223690496e-01 1.437181283883853800e-01
6.931471824645996094e-01 6.931471824645996094e-01 6.931471824645996094e-01 6.931471824645996094e-01 6.931471824645996094e-01 6.931471824645996094e-01 6.931471824645996094e-01 6.931471824645996094e-01 7.001441422018032101e-01 6.857707645129231810e-01 6.931471824645996094e-01 7.061646710900426616e-01 6.917912934011626325e-01 7.015000312652402981e-01 6.964559332259649960e-01 7.084969910024438988e-01 7.288908975795634904e-01 7.061646710900426616e-01 7.001441422018032101e-01 7.242262577547610158e-01 7.075205601534797495e-01 6.941236133135638697e-01 7.302467866430004673e-01 7.145175198906833502e-01 7.362673155312399187e-01 7.385996354436411560e-01 7.218939378423597786e-01 7.242262577547610158e-01 6.894589734887613952e-01 7.098528800658809867e-01 7.261791194526894255e-01 7.182057288665215644e-01 7.372437463802041790e-01 7.228703686913240389e-01 7.358878573167670911e-01 6.964559332259649960e-01 7.288908975795634904e-01 7.145175198906833502e-01 6.951000441625280191e-01 7.164703815886117599e-01 7.001441422018032101e-01 6.964559332259649960e-01 6.964559332259649960e-01 6.974323640749292563e-01 6.987882531383662332e-01 7.011205730507674705e-01 7.048087820266056847e-01 7.001441422018032101e-01 7.001441422018032101e-01 7.048087820266056847e-01
6.779487179487179560e+01 6.812820512820512420e+01 6.805128205128205821e+01 6.830769230769230660e+01 6.823076923076922640e+01 6.802564102564102200e+01 6.810256410256410220e+01 6.823076923076922640e+01 6.943589743589743080e+01 6.984615384615383959e+01 7.153846153846153300e+01 6.987179487179487580e+01 7.282051282051281760e+01 7.205128205128205821e+01 7.212820512820512420e+01 7.366666666666667140e+01 7.430769230769230660e+01 7.507692307692308020e+01 7.487179487179487580e+01 7.638461538461538680e+01 7.438461538461538680e+01 7.774358974358973740e+01 7.869230769230769340e+01 7.989743589743589780e+01 7.964102564102563520e+01 8.084615384615383959e+01 8.174358974358973740e+01 8.323076923076922640e+01 8.348717948717948900e+01 8.197435897435897800e+01 8.487179487179487580e+01 8.612820512820512420e+01 8.794871794871794179e+01 8.902564102564102200e+01 8.800000000000000000e+01 8.953846153846153300e+01 9.041025641025640880e+01 9.102564102564102200e+01 8.961538461538461320e+01 9.220512820512820440e+01 9.071794871794871540e+01 9.261538461538461320e+01 9.264102564102563520e+01 9.402564102564102200e+01 9.415384615384616041e+01 9.458974358974359120e+01 9.441025641025640880e+01 9.453846153846153300e+01 9.492307692307691980e+01 9.546153846153846700e+01
0.000000000000000000e+00 0.000000000000000000e+00 0.000000000000000000e+00 0.000000000000000000e+00 0.000000000000000000e+00 0.000000000000000000e+00 nan 1.487179487179487225e+00 5.589743589743589425e+00 6.076923076923076650e+00 1.271794871794871717e+01 8.641025641025640525e+00 1.728205128205128105e+01 nan 1.592307692307692335e+01 1.894871794871794890e+01 2.153846153846154010e+01 2.428205128205128105e+01 nan 2.779487179487179560e+01 nan 3.271794871794871540e+01 3.530769230769230660e+01 3.853846153846154010e+01 3.889743589743589780e+01 4.017948717948718240e+01 4.374358974358974450e+01 4.638461538461538680e+01 5.146153846153845990e+01 4.856410256410256210e+01 5.453846153846154010e+01 5.676923076923076650e+01 6.346153846153845990e+01 6.320512820512820440e+01 6.515384615384616041e+01 6.846153846153846700e+01 7.210256410256410220e+01 7.220512820512820440e+01 6.971794871794871540e+01 7.707692307692308020e+01 7.323076923076922640e+01 7.635897435897436480e+01 7.792307692307691980e+01 8.187179487179487580e+01 8.358974358974359120e+01 8.200000000000000000e+01 8.343589743589743080e+01 7.953846153846153300e+01 8.310256410256410220e+01 8.625641025641026260e+01
9.958974358974359120e+01 1.000000000000000000e+02 1.000000000000000000e+02 1.000000000000000000e+02 1.000000000000000000e+02 1.000000000000000000e+02 1.000000000000000000e+02 9.976923076923077360e+01 1.000000000000000000e+02 9.943589743589743080e+01 9.815384615384616041e+01 9.974358974358973740e+01 9.887179487179487580e+01 9.930769230769230660e+01 9.823076923076922640e+01 9.951282051282051100e+01 9.861538461538461320e+01 9.884615384615383959e+01 9.823076923076922640e+01 9.887179487179487580e+01 9.812820512820512420e+01 9.833333333333332860e+01 9.846153846153846700e+01 9.956410256410256920e+01 9.833333333333332860e+01 9.915384615384616041e+01 9.935897435897436480e+01 9.933333333333332860e+01 9.866666666666667140e+01 9.830769230769230660e+01 9.892307692307691980e+01 9.853846153846153300e+01 9.958974358974359120e+01 9.979487179487179560e+01 9.933333333333332860e+01 9.894871794871794179e+01 9.976923076923077360e+01 9.910256410256410220e+01 9.889743589743589780e+01 9.958974358974359120e+01 9.858974358974359120e+01 9.979487179487179560e+01 9.961538461538461320e+01 9.915384615384616041e+01 9.925641025641026260e+01 9.979487179487179560e+01 9.935897435897436480e+01 9.971794871794871540e+01 9.979487179487179560e+01 9.958974358974359120e+01
6.407766990291262621e-01 6.407766990291262621e-01 6.407766990291262621e-01 6.407766990291262621e-01 6.407766990291262621e-01 6.407766990291262621e-01 6.407766990291262621e-01 6.407766990291262621e-01 6.407766990291262621e-01 6.601941747572815933e-01 6.407766990291262621e-01 6.310679611650485965e-01 6.504854368932039277e-01 6.310679611650485965e-01 6.504854368932039277e-01 6.310679611650485965e-01 6.019417475728154887e-01 6.310679611650485965e-01 6.407766990291262621e-01 6.019417475728154887e-01 6.213592233009708199e-01 6.504854368932039277e-01 5.922330097087378231e-01 6.213592233009708199e-01 5.825242718446601575e-01 5.825242718446601575e-01 6.019417475728154887e-01 6.019417475728154887e-01 6.504854368932039277e-01 6.213592233009708199e-01 6.213592233009708199e-01 6.116504854368931543e-01 5.922330097087378231e-01 6.116504854368931543e-01 6.019417475728154887e-01 6.504854368932039277e-01 6.019417475728154887e-01 6.213592233009708199e-01 6.601941747572815933e-01 6.407766990291262621e-01 6.407766990291262621e-01 6.504854368932039277e-01 6.504854368932039277e-01 6.601941747572815933e-01 6.504854368932039277e-01 6.504854368932039277e-01 6.407766990291262621e-01 6.407766990291262621e-01 6.407766990291262621e-01 6.407766990291262621e-01
0.000000000000000000e+00 0.000000000000000000e+00 0.000000000000000000e+00 0.000000000000000000e+00 0.000000000000000000e+00 0.000000000000000000e+00 0.000000000000000000e+00 0.000000000000000000e+00 8.108108108108108558e-02 5.405405405405405705e-02 0.000000000000000000e+00 8.108108108108108558e-02 5.405405405405405705e-02 2.702702702702702853e-02 1.081081081081081141e-01 1.081081081081081141e-01 1.351351351351351426e-01 8.108108108108108558e-02 8.108108108108108558e-02 8.108108108108108558e-02 2.702702702702702853e-02 8.108108108108108558e-02 8.108108108108108558e-02 1.081081081081081141e-01 8.108108108108108558e-02 1.081081081081081141e-01 5.405405405405405705e-02 8.108108108108108558e-02 2.702702702702702853e-02 5.405405405405405705e-02 2.432432432432432567e-01 8.108108108108108558e-02 1.621621621621621712e-01 1.351351351351351426e-01 2.162162162162162282e-01 1.081081081081081141e-01 1.351351351351351426e-01 1.081081081081081141e-01 1.621621621621621712e-01 2.702702702702702853e-01 8.108108108108108558e-02 1.081081081081081141e-01 1.081081081081081141e-01 1.891891891891891997e-01 1.351351351351351426e-01 1.621621621621621712e-01 1.351351351351351426e-01 8.108108108108108558e-02 8.108108108108108558e-02 1.351351351351351426e-01
1.000000000000000000e+00 1.000000000000000000e+00 1.000000000000000000e+00 1.000000000000000000e+00 1.000000000000000000e+00 1.000000000000000000e+00 1.000000000000000000e+00 1.000000000000000000e+00 9.545454545454545858e-01 1.000000000000000000e+00 1.000000000000000000e+00 9.393939393939394478e-01 9.848484848484848619e-01 9.696969696969697239e-01 9.545454545454545858e-01 9.242424242424241987e-01 8.636363636363636465e-01 9.393939393939394478e-01 9.545454545454545858e-01 8.939393939393939226e-01 9.545454545454545858e-01 9.696969696969697239e-01 8.787878787878787845e-01 9.090909090909090606e-01 8.636363636363636465e-01 8.484848484848485084e-01 9.090909090909090606e-01 8.939393939393939226e-01 1.000000000000000000e+00 9.393939393939394478e-01 8.333333333333333703e-01 9.090909090909090606e-01 8.333333333333333703e-01 8.787878787878787845e-01 8.181818181818182323e-01 9.545454545454545858e-01 8.636363636363636465e-01 9.090909090909090606e-01 9.393939393939394478e-01 8.484848484848485084e-01 9.545454545454545858e-01 9.545454545454545858e-01 9.545454545454545858e-01 9.242424242424241987e-01 9.393939393939394478e-01 9.242424242424241987e-01 9.242424242424241987e-01 9.545454545454545858e-01 9.545454545454545858e-01 9.242424242424241987e-01
