7.634107254534083786e-01 7.652314119985397234e-01 7.163148498214660931e-01 8.457249070631970289e-01 7.578284723875086115e-01
1.058211256746337675e-01 2.056526701507779276e-01 1.023991227088601880e-01 1.699426510036074478e-01 1.202116402116402138e-01
5.754214341863918003e-01 4.526493240339801161e-01 5.951482830385015355e-01 4.381707607917958436e-01 4.142394822006472688e-01
7.722174711834723926e-01 8.008381560566752988e-01 7.227541060664712802e-01 8.704039339148518239e-01 7.824805821273812523e-01
