9.102212320200124829e-01 8.717059451858462094e-01 8.851606805293005253e-01 9.208573334967387058e-01 8.790225623562007984e-01
7.907044723764980465e-02 1.728825078582958141e-01 8.510998307952623299e-02 1.807335831197002529e-01 1.116374961617756789e-01
9.450607039916149310e-02 6.726605625888341933e-02 1.308532778355879223e-01 1.092892916766038669e-01 1.160034641505993946e-01
9.484350896718782842e-01 9.633410270988730373e-01 9.252474699994469587e-01 9.700010109179134643e-01 9.337682936799934774e-01
