1.449770000000000000e+05 9.941400000000000000e+04 1.254000000000000000e+03 1.019500000000000000e+04
1.694900000000000000e+05 9.609300000000000000e+04 8.469000000000000000e+03 2.178400000000000000e+04
1.494430000000000000e+05 1.398850000000000000e+05 1.686000000000000000e+03 1.369000000000000000e+04
2.080870000000000000e+05 6.888900000000000000e+04 6.068000000000000000e+03 1.070400000000000000e+04
1.412780000000000000e+05 1.644970000000000000e+05 1.987000000000000000e+03 1.995200000000000000e+04
