2.800000000000000000e+01 3.500000000000000000e+01 9.000000000000000000e+00 3.100000000000000000e+01
6.000000000000000000e+01 1.800000000000000000e+01 3.400000000000000000e+01 3.300000000000000000e+01
8.400000000000000000e+01 7.500000000000000000e+01 2.400000000000000000e+01 3.300000000000000000e+01
2.200000000000000000e+01 1.700000000000000000e+01 1.000000000000000000e+01 1.100000000000000000e+01
3.700000000000000000e+01 8.900000000000000000e+01 1.700000000000000000e+01 5.500000000000000000e+01
