6.976626016260162322e-01 7.062088454413931737e-01 6.204480413778618031e-01 8.076480520718438694e-01 5.842686000598082963e-01
1.077928415840405663e-01 1.973722159910270835e-01 9.934552777311629612e-02 1.497064061645888844e-01 1.225863116464590424e-01
7.909861123242204473e-01 6.107493471721813227e-01 8.085327783558793335e-01 5.062008108752683588e-01 8.461187839008158518e-01
6.932906694600046160e-01 7.170827952090307322e-01 6.104524968202178492e-01 8.259018831956559392e-01 5.654811544436268989e-01
