6.978417059478306816e-01 6.948238647318066841e-01 6.917194130539427999e-01 6.866056061370363617e-01 6.818913668486129565e-01 6.783088192087598500e-01 6.703516978199332010e-01 6.656576614353252319e-01 6.558914779544011697e-01 6.547403376524744134e-01 6.416580467405946786e-01 6.406877108406843213e-01 6.295165100457961183e-01 6.146624234740920567e-01 6.079445842544373146e-01 5.908121859611128457e-01 5.826723451510225082e-01 5.650177620077738716e-01 5.554570702841737928e-01 5.392111180367646917e-01 5.184580683361127429e-01 5.028752042775158637e-01 4.860091167120845213e-01 4.655700183845328799e-01 4.467758207002816562e-01 4.227178152208034834e-01 4.044474460916762659e-01 3.929704622459576080e-01 3.876150556395118740e-01 3.532351712165472946e-01 3.453466965595219929e-01 3.171738394850999176e-01 3.027851701668987650e-01 2.907304110562131672e-01 2.708555293603490122e-01 2.584741718279249811e-01 2.412587261073923517e-01 2.239780943528701662e-01 2.190002870199379004e-01 2.084154453788426009e-01 1.885479589189294203e-01 1.764509718702675367e-01 1.633199775989171432e-01 1.517812758212772062e-01 1.448233380554927174e-01 1.338448153482190150e-01 1.273869044654482308e-01 1.173724307373140291e-01 1.099570435270061375e-01 9.772302778640468146e-02
6.948039338506500906e-01 6.931471824645996094e-01 6.935712388877210977e-01 7.119105400710270537e-01 8.624809316520033464e-01 8.397104686704175425e-01 7.485135808073241082e-01 8.463374742146195784e-01 8.301940167772359214e-01 7.342964209359267302e-01 8.192903596779396169e-01 8.074235537956501174e-01 7.694727821596737405e-01 8.562779825309226878e-01 8.226038624500405794e-01 8.024532996374985627e-01 8.114306591708084770e-01 8.195599058578754148e-01 7.685096333766805454e-01 8.067299511925927202e-01 8.199839622809969031e-01 8.373601146813096641e-01 8.285372653911853291e-01 8.046491433834207507e-01 8.169400056888317385e-01 8.145896516997238601e-01 7.523661759392968884e-01 7.647720741814580947e-01 7.991397968653974893e-01 8.179031544718249336e-01 7.846530908140643135e-01 8.017596970344411655e-01 8.159768569058385435e-01 7.720926823287174168e-01 8.169400056888317385e-01 7.905864937552090632e-01 7.908560399351448611e-01 7.618826278324785095e-01 7.542924735052832785e-01 7.856162395970575085e-01 7.523661759392968884e-01 8.096193975415723054e-01 7.678160307736232593e-01 7.849226369940001113e-01 7.516725733362394912e-01 8.020292432143770744e-01 7.602258764464279173e-01 7.566428274943910459e-01 7.566428274943910459e-01 7.585691250603774360e-01
4.860000000000000142e+01 5.050000000000000000e+01 5.020000000000000284e+01 5.525999999999999801e+01 5.424000000000000199e+01 5.935999999999999943e+01 6.015999999999999659e+01 5.984000000000000341e+01 6.279999999999999716e+01 6.257999999999999829e+01 6.695999999999999375e+01 6.214000000000000057e+01 6.521999999999999886e+01 7.042000000000000171e+01 6.895999999999999375e+01 7.095999999999999375e+01 7.328000000000000114e+01 7.240000000000000568e+01 7.618000000000000682e+01 7.592000000000000171e+01 7.801999999999999602e+01 7.815999999999999659e+01 8.150000000000000000e+01 8.301999999999999602e+01 8.304000000000000625e+01 8.528000000000000114e+01 8.670000000000000284e+01 8.685999999999999943e+01 8.606000000000000227e+01 8.957999999999999829e+01 8.934000000000000341e+01 9.078000000000000114e+01 9.143999999999999773e+01 9.223999999999999488e+01 9.329999999999999716e+01 9.270000000000000284e+01 9.348000000000000398e+01 9.454000000000000625e+01 9.478000000000000114e+01 9.465999999999999659e+01 9.587999999999999545e+01 9.659999999999999432e+01 9.600000000000000000e+01 9.843999999999999773e+01 9.709999999999999432e+01 9.759999999999999432e+01 9.865999999999999659e+01 9.868000000000000682e+01 9.879999999999999716e+01 9.928000000000000114e+01
2.810000000000000142e+01 1.982000000000000028e+01 1.020000000000000018e+00 4.802000000000000313e+01 1.817999999999999972e+01 5.624000000000000199e+01 7.254000000000000625e+01 5.657999999999999829e+01 6.306000000000000227e+01 6.892000000000000171e+01 7.150000000000000000e+01 5.750000000000000000e+01 6.714000000000000057e+01 7.235999999999999943e+01 7.457999999999999829e+01 7.657999999999999829e+01 7.357999999999999829e+01 8.470000000000000284e+01 7.345999999999999375e+01 7.964000000000000057e+01 7.981999999999999318e+01 7.878000000000000114e+01 8.323999999999999488e+01 8.543999999999999773e+01 7.742000000000000171e+01 8.564000000000000057e+01 8.709999999999999432e+01 8.600000000000000000e+01 8.557999999999999829e+01 8.579999999999999716e+01 8.807999999999999829e+01 8.801999999999999602e+01 8.829999999999999716e+01 8.970000000000000284e+01 9.340000000000000568e+01 8.962000000000000455e+01 8.987999999999999545e+01 9.345999999999999375e+01 9.265999999999999659e+01 9.370000000000000284e+01 9.462000000000000455e+01 9.356000000000000227e+01 9.426000000000000512e+01 9.748000000000000398e+01 9.590000000000000568e+01 9.631999999999999318e+01 9.842000000000000171e+01 9.785999999999999943e+01 9.854000000000000625e+01 9.884000000000000341e+01
6.748000000000000398e+01 8.371999999999999886e+01 9.964000000000000057e+01 6.356000000000000227e+01 9.021999999999999886e+01 6.414000000000000057e+01 4.953999999999999915e+01 6.407999999999999829e+01 6.347999999999999687e+01 5.800000000000000000e+01 6.389999999999999858e+01 6.787999999999999545e+01 6.445999999999999375e+01 6.773999999999999488e+01 6.485999999999999943e+01 6.529999999999999716e+01 7.185999999999999943e+01 6.075999999999999801e+01 7.818000000000000682e+01 7.212000000000000455e+01 7.378000000000000114e+01 7.781999999999999318e+01 7.920000000000000284e+01 8.006000000000000227e+01 8.681999999999999318e+01 8.440000000000000568e+01 8.529999999999999716e+01 8.754000000000000625e+01 8.665999999999999659e+01 9.350000000000000000e+01 8.851999999999999602e+01 9.350000000000000000e+01 9.415999999999999659e+01 9.451999999999999602e+01 9.351999999999999602e+01 9.571999999999999886e+01 9.568000000000000682e+01 9.451999999999999602e+01 9.662000000000000455e+01 9.573999999999999488e+01 9.735999999999999943e+01 9.876000000000000512e+01 9.784000000000000341e+01 9.921999999999999886e+01 9.820000000000000284e+01 9.834000000000000341e+01 9.893999999999999773e+01 9.937999999999999545e+01 9.864000000000000057e+01 9.981999999999999318e+01
5.931034482758620330e-01 5.931034482758620330e-01 6.137931034482758674e-01 5.655172413793103647e-01 4.482758620689655249e-01 4.689655172413793038e-01 5.999999999999999778e-01 4.689655172413793038e-01 4.896551724137930828e-01 6.068965517241379226e-01 4.965517241379310276e-01 5.103448275862069172e-01 5.448275862068965303e-01 4.689655172413793038e-01 4.965517241379310276e-01 5.103448275862069172e-01 5.172413793103448620e-01 4.827586206896551935e-01 5.517241379310344751e-01 5.034482758620689724e-01 5.034482758620689724e-01 4.620689655172413590e-01 4.896551724137930828e-01 4.827586206896551935e-01 4.896551724137930828e-01 4.827586206896551935e-01 5.724137931034483096e-01 5.310344827586206407e-01 5.103448275862069172e-01 4.827586206896551935e-01 5.310344827586206407e-01 5.034482758620689724e-01 4.965517241379310276e-01 5.379310344827585855e-01 4.896551724137930828e-01 5.241379310344828069e-01 5.103448275862069172e-01 5.517241379310344751e-01 5.586206896551724199e-01 5.241379310344828069e-01 5.724137931034483096e-01 4.827586206896551935e-01 5.448275862068965303e-01 5.172413793103448620e-01 5.655172413793103647e-01 4.896551724137930828e-01 5.517241379310344751e-01 5.655172413793103647e-01 5.655172413793103647e-01 5.517241379310344751e-01
1.694915254237288130e-02 0.000000000000000000e+00 1.355932203389830504e-01 1.694915254237288130e-02 8.135593220338983578e-01 7.118644067796610075e-01 6.101694915254237683e-01 7.796610169491525744e-01 7.457627118644067910e-01 5.084745762711864181e-01 6.779661016949152241e-01 6.440677966101694407e-01 4.745762711864406902e-01 8.813559322033898136e-01 7.118644067796610075e-01 5.932203389830508211e-01 7.288135593220338437e-01 5.932203389830508211e-01 5.084745762711864181e-01 5.932203389830508211e-01 7.288135593220338437e-01 6.440677966101694407e-01 7.288135593220338437e-01 4.406779661016949068e-01 6.101694915254237683e-01 5.423728813559322015e-01 4.745762711864406902e-01 3.389830508474576121e-01 5.593220338983050377e-01 5.762711864406779849e-01 5.423728813559322015e-01 5.423728813559322015e-01 6.440677966101694407e-01 4.576271186440677985e-01 6.101694915254237683e-01 5.593220338983050377e-01 4.745762711864406902e-01 4.406779661016949068e-01 4.067796610169491789e-01 5.084745762711864181e-01 4.745762711864406902e-01 4.915254237288135819e-01 4.576271186440677985e-01 4.576271186440677985e-01 4.237288135593220151e-01 4.576271186440677985e-01 4.237288135593220151e-01 4.745762711864406902e-01 4.745762711864406902e-01 4.067796610169491789e-01
9.883720930232557933e-01 1.000000000000000000e+00 9.418604651162790775e-01 9.418604651162790775e-01 1.976744186046511531e-01 3.023255813953488191e-01 5.930232558139535426e-01 2.558139534883721034e-01 3.139534883720930258e-01 6.744186046511627675e-01 3.720930232558139483e-01 4.186046511627907196e-01 5.930232558139535426e-01 1.860465116279069742e-01 3.488372093023255904e-01 4.534883720930232287e-01 3.720930232558139483e-01 4.069767441860465129e-01 5.813953488372093359e-01 4.418604651162790775e-01 3.488372093023255904e-01 3.372093023255813837e-01 3.255813953488372325e-01 5.116279069767442067e-01 4.069767441860465129e-01 4.418604651162790775e-01 6.395348837209302584e-01 6.627906976744185608e-01 4.767441860465116421e-01 4.186046511627907196e-01 5.232558139534884134e-01 4.767441860465116421e-01 3.953488372093023062e-01 5.930232558139535426e-01 4.069767441860465129e-01 5.000000000000000000e-01 5.348837209302325091e-01 6.279069767441860517e-01 6.627906976744185608e-01 5.348837209302325091e-01 6.395348837209302584e-01 4.767441860465116421e-01 6.046511627906976383e-01 5.581395348837209225e-01 6.627906976744185608e-01 5.116279069767442067e-01 6.395348837209302584e-01 6.279069767441860517e-01 6.279069767441860517e-01 6.511627906976744651e-01
