9.298272357723577075e-01 8.859908868427101014e-01 9.102571676118462740e-01 9.322514536269183028e-01 8.955644250779642990e-01
6.593699946609717089e-02 1.842631292022533229e-01 8.094671241509698856e-02 1.892750744786494410e-01 1.107097591888466376e-01
4.314787317669665362e-02 3.351733712359104833e-02 7.518210197710717413e-02 5.682089196279513366e-02 7.962988285701262658e-02
9.713655576514683698e-01 9.830975627205054135e-01 9.546362605762318543e-01 9.852622609901219297e-01 9.541067778595372362e-01
