ID	Longitude	Latitude	X UTM (m)	Y UTM (m)
A0	     4.6888828	    44.3057970	634707.7879757	4907224.9076675
A1	     4.6285159	    44.2982618	629909.4206648	4906290.5449292
A2	     4.6304000	    44.3150000	630022.7554649	4908152.7255464
A3	     4.5953540	    44.2720740	627320.5892795	4903329.7566020
A4	     4.5936180	    44.3592000	626993.9497472	4913004.5894681
A5	     4.6336990	    44.3716610	630160.3847441	4914451.6172322
A6	     4.6274570	    44.3788230	629647.2604903	4915237.2446533
B0	     4.6462920	    44.2848760	631357.3007249	4904832.0313311
B1	     4.6503730	    44.2980870	631653.4010247	4906305.9818592
B2	     4.6530770	    44.3151550	631830.8889013	4908206.1535583
B3	     4.6532000	    44.3370000	631791.7641777	4910632.7917463
B4	     4.6549000	    44.3460000	631907.1009238	4911635.2071880
B5	     4.6526650	    44.3619330	631693.2574957	4913401.3830284
B6	     4.6706930	    44.3759460	633098.0886951	4914987.0313090
C0	     4.6730550	    44.2838080	633495.1502439	4904756.6056474
C1	     4.6705550	    44.3016130	633255.3918372	4906730.2264532
C2	     4.6727700	    44.3173000	633396.5321222	4908476.2622506
C3	     4.6779980	    44.3269960	633791.4027004	4909561.7676758
C4	     4.6715000	    44.3441600	633234.4148510	4911457.6827740
C5	     4.6806000	    44.3628400	633917.2171896	4913547.4150746
C6	     4.7692070	    44.4000860	640888.4640544	4917833.2376290
D0	     4.7124090	    44.2822480	636638.8965037	4904648.1222123
D1	     4.6941000	    44.3029000	635130.5701375	4906911.7069600
D2	     4.6955000	    44.3127000	635219.7354433	4908002.5503470
D3	     4.7075400	    44.3330000	636132.9924319	4910277.3061049
D4	     4.7007980	    44.3440260	635570.0690335	4911490.8501309
D5	     4.6995620	    44.3624540	635429.0884034	4913535.7122536
D6	     4.6980900	    44.3778000	635276.4538858	4915237.8547443
E0	     4.7314610	    44.2491090	638236.7967582	4900999.1378801
E1	     4.7199200	    44.3009600	637194.6479383	4906739.0914417
E2	     4.7162100	    44.3136590	636869.1849431	4908143.4340891
E3	     4.7329000	    44.3188000	638188.1672172	4908742.4683314
E4	     4.7356780	    44.3466800	638344.1192562	4911843.9411290
E5	     4.7200800	    44.3626000	637063.7301665	4913586.0540721
E6	     4.7243000	    44.3789700	637361.7227233	4915411.4410896
F0	     4.7451920	    44.2834790	639251.8752807	4904839.9802877
F1	     4.7333920	    44.2888980	638297.6064580	4905421.9318417
F2	     4.7488620	    44.3142870	639471.7418006	4908268.2144619
F3	     4.7465860	    44.3248620	639265.2048188	4909438.9670268
F5	     4.7439200	    44.3619880	638964.8698196	4913558.2398795
F6	     4.7435320	    44.3767700	638899.0015849	4915199.5104339
G0	     4.7614120	    44.2846400	640543.3388313	4904996.5990673
G1	     4.7633930	    44.2949400	640676.8091748	4906144.0657840
G3	     4.7667920	    44.3313380	640860.8519650	4910192.8185801
G4	     4.7680630	    44.3495310	640918.5878285	4912215.8046226
G5	     4.7680260	    44.3649740	640878.6206766	4913931.0882483
G6	     4.7696960	    44.3743000	640989.3081456	4914969.8588953
RF-S	     4.6304560	    44.5050280	629606.7740204	4929260.5160319
RF-C	     4.6573730	    44.5239620	631703.7831675	4931406.7253288
RF-N	     4.6780960	    44.5388230	633316.6369410	4933091.0914201
