id,original_id,call_number,cleaned_call_nb,,,description,publication_id,library_id,script_id,title,subtitle,alternative_title,alternative_subtitle,start,end,cesar_editor
84,306776,"YF-5707 (4), Tolbiac / rez-de-jardin / magasin",YF-5707,http://catalogue.bnf.fr/ark:/12148/cb301675612,http://gallica.bnf.fr/ark:/12148/bpt6k9763121m,,5438,1,7095,L’Ecole des bourgeois,,,,1821,1821,Touquet
140,306872,"MFICHE 8-YTH-730, Tolbiac / rez-de-jardin / magasin",8-YTH-730,http://catalogue.bnf.fr/ark:/12148/cb361172255,http://gallica.bnf.fr/ark:/12148/bpt6k58462240,,5467,1,1030,L’Amour et l’innocence,,,,1768,1768,
287,307626,RES-YF-1997-1998 support imprimé,RES-YF-1997,http://catalogue.bnf.fr/ark:/12148/cb31274529c,http://gallica.bnf.fr/ark:/12148/bpt6k1516281n,"[Tolbiac - Rez-de-jardin - magasin] Divertissement donné à Son Éminence Monseigneur le cardinal de Bonsy, à l'occasion de la paix, par le sr de Sablières, à Montpelier, pendant la tenue des Estats, en janvier de l'année 1679. Montpelier : impr. de D. Pech, 1679, In-4, pièces limin., et 20 p.",5596,1,6718,Divertissement donné à Son Eminence le Cardinal de Bonzi,,,,1679,1679,Pech
321,307747,SMITH LESOUEF R-3672 (2) < Ex. 1 > support imprimé,R-3672,http://catalogue.bnf.fr/ark:/12148/cb30908249r,,"[Tolbiac - Rez-de-jardin - magasin] Vasthi, tragédie de Pierre Matthieu,… A Lyon : B. Rigaud, 1589, In-12, pièces liminaires, 104 p., portrait.",5623,1,18261,Vasthi,,,,1589,1589,Rigaud
332,307825,YF-7596 support imprimé / Tolbiac / rez-de-jardin / magasin,YF-7596  / Tolbiac / rez-de-jardin / magasin,http://catalogue.bnf.fr/ark:/12148/cb30297776f,,"Auteur(s) :   Dancourt, Florent Carton, dit
Titre(s) :   Renaud et Armide, comédie de M. Dancourt [Texte imprimé]
Publication :  Paris : T. Guillain, 1697
Description matérielle :  In-12, 66 p.
Notice n° : FRBNF30297776     [DT]",5638,1,15655,Renaud et Armide,,,,1697,1697,"Guillain, Thomas"
543,310898,Tolbiac / rez-de-jardin / magasin,Tolbiac / rez-de-jardin / magasin,??,,"[Z ROTHSCHILD- 4044 support imprimé] Acis et Galatée, pastorale héroïque en musique, représentée pour la première fois dans le château d'Anet… par l'Académie royale de musique. [Paroles de Campistron, musique de Lulli.] Publication :  Amsterdam, A. Schelte 1695. - In-12, 43 p. [Don 220220]",5833,1,197,Acis et Galatée,,,,1695,1695,Schelte
551,311247,Y-5913 (A) support imprimé,Y-5913 (A) ,??,,"[Tolbiac - Rez-de-jardin - magasin] Hippolyte et Aricie, tragédie… (opéra)… Paris : D. Larmel, 1767, In-4.",5845,1,9899,Hippolyte et Aricie,,,,1767,1767,Delormel
737,319998,RES-LK12-724 (2) support imprimé,RES-LK12-724 (2) ,??,,"[Tolbiac - Rez-de-jardin - magasin] BNF, catalogue : Les Muses de la Nouvelle France, à Mgr le Chancellier. [Signé : Marc Lescarbot.] 
Publication :  Paris : J. Millot, 1609, In-8, pièces limin., 66 p. [AS]",6091,1,17450,Le Théâtre de Neptune en la Nouvelle France,,,,1609,1609,"Millot, Jean"
795,320495,YF-3699 < Vol. 4 > support imprimé,YF-3699 < Vol. 4 > ,https://catalogue.bnf.fr/ark:/12148/cb31051784k,https://gallica.bnf.fr/ark:/12148/bpt6k6541599p,"[Tolbiac - Rez-de-jardin - magasin] BNF, catalogue :   Œuvres de théâtre de MM. de Brueys et de Palaprat. Nouvelle édition… [par d'Alençon.] Paris : Briasson, 1755-1756, 5 vol. in-12, portr.
Volume IV : Par M. de Brueys : la Force du sang, les Quiproquo, les Embarras du derrière du théâtre, Paraphrases de l'Art poétique d'Horace. Par M. de Palaprat : le Concert ridicule. [AS]",4825,1,5344,Le Concert ridicule,,,,1755,1756,Briasson
796,320497,YF-10547 < Vol. 1 > support imprimé,YF-10547 < Vol. 1 > ,http://catalogue.bnf.fr/ark:/12148/cb310517806,,"[Tolbiac - Rez-de-jardin - magasin] BNF, catalogue : Les Œuvres de M. de Palaprat. Nouvelle édition, augmentée de plusieurs comédies qui n'ont pas encore été imprimées ; d'un recueil de pièces en vers, adressées à Mgr le duc de Vendome, et de divers essais de différentes poésies, avec une lettre à M. B. P. M. D. M. [Mr. Boudin, premier médecin de Madame la Dauphine.] contenant quelques légères observations sur une devise…  Paris : P. Ribou, 1711, 2 vol. in-12, pl.
Volume I :  Le Concert ridicule. Le Ballet extravagant. Le Secret révélé. Le Grondeur. Le Muet. [AS]",48,1,5344,Le Concert ridicule,,,,1711,1711,"Ribou, Pierre"
797,320499,YF-10547 < Vol. 1 > support imprimé,YF-10547 < Vol. 1 > ,http://catalogue.bnf.fr/ark:/12148/cb31051781j,,"[Tolbiac - Rez-de-jardin - magasin] Les Œuvres de M. de Palaprat. Nouvelle édition, augmentée de plusieurs comédies qui n'ont pas encore été imprimées ; d'un recueil de pièces en vers, adressées à Mgr le duc de Vendome, et de divers essais de différentes poésies, avec une lettre à M. B. P. M. D. M. [Mr. Boudin, premier médecin de Madame la Dauphine.] contenant quelques légères observations sur une devise… Publication :  Paris : P. Ribou, 1712, 2 vol. in-12.
Comprend :   I. Le Concert ridicule. Le Ballet extravagant. Le Secret révélé. Le Grondeur. Le Muet. [AS]",6175,1,5344,Le Concert ridicule,,,,1712,1712,"Ribou, Pierre"
801,320508,YF-10547 < Vol. 1 > support imprimé,YF-10547 < Vol. 1 > ,http://catalogue.bnf.fr/ark:/12148/cb310517806,,"[Tolbiac - Rez-de-jardin - magasin] BNF, catalogue : 
Les Œuvres de M. de Palaprat. Nouvelle édition, augmentée de plusieurs comédies qui n'ont pas encore été imprimées ; d'un recueil de pièces en vers, adressées à Mgr le duc de Vendome, et de divers essais de différentes poésies, avec une lettre à M. B. P. M. D. M. [Mr. Boudin, premier médecin de Madame la Dauphine.] contenant quelques légères observations sur une devise… 
Publication :  Paris : P. Ribou, 1711, 2 vol. in-12, pl.
Comprend :   I. Le Concert ridicule. Le Ballet extravagant. Le Secret révélé. Le Grondeur. Le Muet. [AS]",4794,1,12966,Le Muet,,,,1711,1711,"Ribou, Pierre"
802,320510,YF-10547 < Vol. 1 > support imprimé,YF-10547 < Vol. 1 > ,http://catalogue.bnf.fr/ark:/12148/cb31051781j,,"[Tolbiac - Rez-de-jardin - magasin] BNF, catalogue :   Les Œuvres de M. de Palaprat. Nouvelle édition, augmentée de plusieurs comédies qui n'ont pas encore été imprimées ; d'un recueil de pièces en vers, adressées à Mgr le duc de Vendome, et de divers essais de différentes poésies, avec une lettre à M. B. P. M. D. M. [Mr. Boudin, premier médecin de Madame la Dauphine.] contenant quelques légères observations sur une devise… 
Publication :  Paris : P. Ribou, 1712, 2 vol. in-12.
Comprend :   I. Le Concert ridicule. Le Ballet extravagant. Le Secret révélé. Le Grondeur. Le Muet. [AS]",6178,1,12966,Le Muet,,,,1712,1712,"Ribou, Pierre"
803,320512,YF-10547 < Vol. 1 > support imprimé,YF-10547 < Vol. 1 > ,http://catalogue.bnf.fr/ark:/12148/cb310517806,,"[Tolbiac - Rez-de-jardin - magasin] BNF, catalogue : Les Œuvres de M. de Palaprat. Nouvelle édition, augmentée de plusieurs comédies qui n'ont pas encore été imprimées ; d'un recueil de pièces en vers, adressées à Mgr le duc de Vendome, et de divers essais de différentes poésies, avec une lettre à M. B. P. M. D. M. [Mr. Boudin, premier médecin de Madame la Dauphine.] contenant quelques légères observations sur une devise… Publication :  Paris : P. Ribou, 1711, 
 2 vol. in-12, pl.
Comprend :   I. Le Concert ridicule. Le Ballet extravagant. Le Secret révélé. Le Grondeur. Le Muet. [AS]",4795,1,16592,Le Secret révélé,,,,1711,1711,"Ribou, Pierre"
804,320514,YF-10547 < Vol. 1 > support imprimé,YF-10547 < Vol. 1 > ,http://catalogue.bnf.fr/ark:/12148/cb31051781j,,"[Tolbiac - Rez-de-jardin - magasin] BNF, catalogue : Les Œuvres de M. de Palaprat. Nouvelle édition, augmentée de plusieurs comédies qui n'ont pas encore été imprimées ; d'un recueil de pièces en vers, adressées à Mgr le duc de Vendome, et de divers essais de différentes poésies, avec une lettre à M. B. P. M. D. M. [Mr. Boudin, premier médecin de Madame la Dauphine.] contenant quelques légères observations sur une devise… 
Publication :  Paris : P. Ribou, 1712, 2 vol. in-12.
Comprend :   I. Le Concert ridicule. Le Ballet extravagant. Le Secret révélé. Le Grondeur. Le Muet. [AS]",6179,1,16592,Le Secret révélé,,,,1712,1712,"Ribou, Pierre"
839,320791,2 exemplaires imprimés,2 exemplaires imprimés,??,,"Tolbiac - Rez-de-jardin - magasin
      YF- 7373 support imprimé 
Tolbiac - Rez-de-jardin - magasin
      YF- 8952 support imprimé",837,1,10621,L’Irrésolu,,,,1713,1713,"Le Breton, François"
840,320794,3 exemplaires,3 exemplaires,??,,"1 - Tolbiac - Haut-de-jardin - Littérature et art - Salle H - Littératures d'expression française
      84/33 DEST 4 irre support imprimé 
 2 - Tolbiac - Rez-de-jardin - libre-accès - Littérature et art - Salle V - Littératures d'expression française
      84/33 DEST 4 irre support imprimé 
 3 - Tolbiac - Rez-de-jardin - magasin
      16- YF- 2548 support imprimé",6230,1,10621,L’Irrésolu,,,,1995,1995,Société des textes français modernes
867,321672,8-BL-12937 (1) < Pièce n° 1. Recueil > support imprimé,8-BL-12937 (1) < Pièce n° 1. Recueil > ,http://catalogue.bnf.fr/ark:/12148/cb36030429n,http://gallica.bnf.fr/ark:/12148/bpt6k73934x,"[Arsenal - magasin] BNF, catalogue : La mère coquette ou Les amans brouillez : comédie représentée par la troupe du roy / [par Jean Donneau de Vizé]
Publication :  Paris : T. Girard, 1666, 
[5] f-71 p.
Note(s) :   Par Jean Donneau de Vizé d'après les éditions postérieures. - Les feuillets sont imprimés recto-verso. [AS]",6265,1,12480,La Mère coquette,ou les Amants brouillés,,,1666,1666,"Girard, Théodore"
880,321707,8-BL-13466 (7) < Ex. 1. Tome 23. Pièce n° 7. Recueil factice > support imprimé,8-BL-13466 (7) < Ex. 1. Tome 23. Pièce n° 7. Recueil factice > ,http://catalogue.bnf.fr/ark:/12148/cb31096553s,,"[Arsenal - magasin] BNF, catalogue :  Stratonice, tragédie nouvelle, par M. Peyraud de Beaussol… Publication :  La Haye, 1756, In-8, 112 p. [AS]",5236,1,17093,Stratonice,,,,1756,1756,
896,321739,YE-7849 < Vol. 2 > support imprimé,YE-7849 < Vol. 2 > ,http://catalogue.bnf.fr/ark:/12148/cb31308345r,,"[Tolbiac - Rez-de-jardin - magasin] BNF, catalogue : Œuvres de Scarron. Nouvelle édition… augmentée…
Publication :  Paris : David père, Durand, Pissot, 1752, 
In-12, fig. Comprend :   II. [Typhon. - Jodelet ou le Maistre valet. Le Jodelet duelliste. L'Héritier ridicule.] [AS]",4817,1,10958,Jodelet,ou le Maître valet,,,1752,1752,David père/Durand/Pissot
947,324438,YF-3472 < Vol. 2 > support imprimé,YF-3472 < Vol. 2 > ,http://catalogue.bnf.fr/ark:/12148/cb31168712s,http://gallica.bnf.fr/ark:/12148/bd6t54173127w,"[Tolbiac - Rez-de-jardin - magasin] BNF, catalogue : Œuvres de Jean Racine, avec des commentaires par M. Luneau de Boisjermain. T. I [-V]. - Œuvres diverses de Jean Racine, enrichies de notes et de préfaces. T. VI [-VII] Paris : impr. de L. Cellot ; (et Londres) 1768, 7 vol. in-8, pl. par Gravelot, portrait par C. Le Brun
Comprend :   […] II. Andromaque, les Plaideurs, Britannicus. [AS]",4793,1,1416,Andromaque,,,,1768,1768,"Cellot, Louis"
959,324692,RES-YF-3231 < Vol. 2 > support imprimé,RES-YF-3231 < Vol. 2 > ,http://catalogue.bnf.fr/ark:/12148/cb311686909,,"[Tolbiac - Rez-de-jardin - magasin] BNF, catalogue :   Œuvres de Racine. 
Publication :  Paris : par la compagnie des libraires, 1713, 
2 vol. in-12, pl.
Comprend :   I. […] II. Bajazet, Mithridate, Iphigénie, Phèdre, Esther, Athalie. Cantiques spirituels. [AS]",4811,1,2697,Bajazet,,,,1713,1713,Compagnie des Libraires
960,324694,RES-YF-3235 < Vol. 2 > support imprimé,RES-YF-3235 < Vol. 2 > ,http://catalogue.bnf.fr/ark:/12148/cb31034597p,,"[Tolbiac - Rez-de-jardin - magasin] BNF, catalogue :   Œuvres de Racine, nouvelle édition, augmentée de diverses pièces et de remarques, etc… Publication :  Amsterdam, Leipzig : Arkstée et Merkus, 1750, 3 vol. in-12, pl., portrait.<br>
Comprend :   I. […] II. Bajazet, Mithridate, Iphigénie, Phèdre, Esther, Athalie, Cantiques spirituels, Épigrammes, Remarques, Deux lettres concernant les ouvrages de MM. Corneille et Racine. III. […] [AS]",4812,1,2697,Bajazet,,,,1750,1750,Arkstée/Merkus
961,324696,YF-3461 < Vol. 2 > support imprimé,YF-3461 < Vol. 2 > ,http://catalogue.bnf.fr/ark:/12148/cb31168693b,,"[Tolbiac - Rez-de-jardin - magasin] BNF, catalogue : Œuvres de Racine… Nouvelle édition [par A.-A. Bruzen de La Martinière] augmentée de diverses pièces et de remarques, etc. 
Publication :  Amsterdam : J. F. Bernard, 1722, 2 vol. in-12, pl. et frontisp. gr.
Comprend :   I. […] II. Bajazet, Mithridate, Iphigénie, Phèdre, Esther, Athalie. Cantiques. Épigrammes, Remarques. Deux lettres concernant les ouvrages de MM. Corneille et Racine. Apollon charlatan [par Barbier d'Aucourt] [AS]",4813,1,2697,Bajazet,,,,1722,1722,"Bernard, J. F."
962,324698,YF-10767 < Vol. 2 > support imprimé,YF-10767 < Vol. 2 > ,http://catalogue.bnf.fr/ark:/12148/cb31168694p,,"[Tolbiac - Rez-de-jardin - magasin] BNF, catalogue : Œuvres de Racine… Nouvelle édition [par A.-A. Bruzen de La Martinière] augmentée de diverses pièces et de remarques, etc.
Publication :  Paris : la compagnie des libraires, 1728, 2 vol. in-12.<br>
Comprend :   I. […] II. Bajazet. Mithridate. Iphigénie. Phèdre. Esther. Athalie. Cantiques spirituels. Remarques curieuses et critique, 1re [-2e] lettre à M. D. L***. [AS]",4814,1,2697,Bajazet,,,,1728,1728,Compagnie des Libraires
963,324700,YF-405 < Vol. 2 > support imprimé,YF-405 < Vol. 2 > ,http://catalogue.bnf.fr/ark:/12148/cb30276277r,http://gallica.bnf.fr/ark:/12148/bd6t5378603g,"[Tolbiac - Rez-de-jardin - magasin] BNF, catalogue : Œuvres de Racine [publiées par P. Coste] Publication :  Londres : impr. de J. Tonson et J. Watts, 1723, 2 vol. in-4, pl. de L. Cheron, gr. par Van der Gucht, C. du Bosc, P. Fourdrinier.<br>
Comprend :   I. […] II. Bajazet. Mithridate. Iphigénie. Phèdre. Athalie. Cantiques spirituels. Épigrammes. La Nymphe de la Seine. [AS]",6415,1,2697,Bajazet,,,,1723,1723,"Tonson, J."
964,324705,Z FRANCE-274 < Ex. 1 > support imprimé,Z FRANCE-274 < Ex. 1 > ,http://catalogue.bnf.fr/ark:/12148/cb365730754,,"[Tolbiac - Rez-de-jardin - magasin] BNF, catalogue : Horace, tragédie par P. Corneille.
Publication :  Paris : suivant la copie imprimée, 1682, In-16, 64 p., front. [AS]",6417,1,10055,Horace,,,,1682,1682,
977,324869,Rf. Rés. 1696,Rf. Rés. 1696,??,,"Paris, Bibl. de l'Arsenal. [GF]",4786,1,4792,Le Cid,,,,1648,1648,"Sommaville, Antoine de"
989,324918,SMITH LESOUEF R-3514 < Ex. 1 > support imprimé,SMITH LESOUEF R-3514 < Ex. 1 > ,http://catalogue.bnf.fr/ark:/12148/cb36576916t,,"[Tolbiac - Rez-de-jardin - magasin] BNF, catalogue : Cinna, ou la clémence d'Auguste, tragédie… 
Publication :  A Paris : T. Quinet, 1643, In-24, XVIII-76 p., titre gravé. [AS]",6439,1,4797,Cinna,ou la Clémence d’Auguste,,,1643,1643,Toussaint Quinet
1040,325870,RES-YF-3022-3033 support imprimé,RES-YF-3022-3033 ,http://catalogue.bnf.fr/ark:/12148/cb31606092g,http://gallica.bnf.fr/ark:/12148/bd6t5374753d,"[Tolbiac - Rez-de-jardin - magasin] BNF, catalogue : Théâtre de Pierre Corneille, avec des commentaires, etc. Publication :  (Genève : Cramer), 1764, 12 vol. in-8, pl. gr. d'après Gravelot, par C. Baquoy, J.-J. Flipart, N. Lemire, L.-S. Lempereur, J. de Longueil, Prévost l'aîné, A. Radigues et C.-H. Watelet. (Bengesco, nos 1700 et 1896 ; Picot, n 640.)
Comprend :  VII. [Œdipe ; la Toison d'or ; Sertorius.] - 468 p., 3 pl. gr. Note(s) :   Les faux titres portent : ""P. Corneille"". T. I-XII. - Édition impr. avec les caractères de Fournier-le-Jeune et les vignettes de Cramer. [AS]",4909,1,16687,Sertorius,,,,1764,1764,"Cramer, Frères"
1043,325876,RES-YF-130-137 support imprimé,RES-YF-130-137 ,http://catalogue.bnf.fr/ark:/12148/cb316060945,http://gallica.bnf.fr/ark:/12148/btv1b8615784g,"[Tolbiac - Rez-de-jardin - magasin] BNF, catalogue : Théâtre de P. Corneille, avec des commentaires et autres morceaux intéressans. Nouvelle édition augmentée.<br>
Publication :  Genève (Berlin : Rottman), 1774, 8 vol. in-4, titres, textes et pl. encadrés, frontisp. et pl. gr. d'après Gravelot. (Bengesco, n 1700, p. 141 ; Picot, n 643.)
Comprend :  […] VI. [Othon ; Agésilas ; Attila ; Bérénice, tragédie de Racine ; Bérénice, comédie héroïque de Corneille ; Pulchérie.] - 610 p., 5 pl. gr. […] <br>
Note(s) :   Dans sa lettre à d'Argental du 16 avril 1775 [Besterman, n  18309], Voltaire parle de l'édition in-4 comme publiée par Panckouke et de Tournes. - Même ill. que dans l'édition de Genève, 1765. [AS]",6497,1,15306,Pulchérie,,,,1774,1774,
1044,325878,,,??,,"Théâtre de Pierre Corneille, avec des commentaires, etc. Publication :  (Genève : Cramer), 1764, 12 vol. in-8, pl. gr. d'après Gravelot, par C. Baquoy, J.-J. Flipart, N. Lemire, L.-S. Lempereur, J. de Longueil, Prévost l'aîné, A. Radigues et C.-H. Watelet. (Bengesco, nos 1700 et 1896 ; Picot, n 640.)<br>
Comprend :  […] X. [Pulchérie ; Ariane, tragédie de Thomas Corneille ; le Comte d'Essex, tragédie de Thomas Corneille ; Mélite, comédie.] - 496 p., 1 f. d'errata, 4 pl. gr. […]
Note(s) :   Les faux titres portent : ""P. Corneille"". T. I-XII. - Édition impr. avec les caractères de Fournier-le-Jeune et les vignettes de Cramer. [AS]",6498,1,15306,Pulchérie,,,,1764,1764,"Cramer, Frères"
1066,325921,RES-YF-130-137 support imprimé,RES-YF-130-137 ,http://catalogue.bnf.fr/ark:/12148/cb316060945,http://gallica.bnf.fr/ark:/12148/btv1b8615784g,"[Tolbiac - Rez-de-jardin - magasin] BNF, catalogue : Théâtre de P. Corneille, avec des commentaires et autres morceaux intéressans. Nouvelle édition augmentée. Publication :  Genève (Berlin : Rottman), 1774, 8 vol. in-4, titres, textes et pl. encadrés, frontisp. et pl. gr. d'après Gravelot. (Bengesco, n 1700, p. 141 ; Picot, n 643.)
Comprend : […] II. [Horace ; Polyeucte ; le Menteur.] - 526 p., 3 pl. gr. […]<br>
Note(s) :   Dans sa lettre à d'Argental du 16 avril 1775 [Besterman, n 18309], Voltaire parle de l'édition in-4 &#778; comme publiée par Panckouke et de Tournes. - Même ill. que dans l'édition de Genève, 1765. [AS]",4908,1,14758,Polyeucte martyr,,,,1774,1774,
1067,325923,RES-YF-3022-3033 support imprimé,RES-YF-3022-3033 ,http://catalogue.bnf.fr/ark:/12148/cb31606092g,http://gallica.bnf.fr/ark:/12148/bd6t5374753d,"[Tolbiac - Rez-de-jardin - magasin] BNF, catalogue : Théâtre de Pierre Corneille, avec des commentaires, etc.  Publication :  (Genève : Cramer), 1764, 12 vol. in-8, pl. gr. […] (Bengesco, nos 1700 et 1896 ; Picot, n 640.)<br>
Comprend :  […]  III. [Polyeucte, martyr ; Pompée ; le Menteur.] - 510 p., 1 f. d'errata, 3 pl. gr. […] Note(s) :   Les faux titres portent : ""P. Corneille"". T. I-XII. - Édition impr. avec les caractères de Fournier-le-Jeune et les vignettes de Cramer. [AS]",6515,1,14758,Polyeucte martyr,,,,1764,1764,"Cramer, Frères"
1108,326151,8-BL-13545 (5) < Tome 24.,8-BL-13545 (5) < Tome 24.,http://catalogue.bnf.fr/ark:/12148/cb30249676m,http://gallica.bnf.fr/ark:/12148/bpt6k1083582,"[Arsenal - magasin]
8-BL-13545 (5) < Tome 24. Pièce n° 5. Recueil factice > support imprimé. [AS]",6546,1,12325,Médée,,,,1779,1779,"Moutard, Nicolas-Léger"
1110,326155,8-Z LE SENNE-10902 (13) support imprimé,8-Z LE SENNE-10902 (13) ,http://catalogue.bnf.fr/ark:/12148/cb319257269,,"[Tolbiac - Rez-de-jardin - magasin] BNF, catalogue : Zénis et Almasie. Ballet héroïque représenté devant Leurs Majestés à Fontainebleau le 2 novembre 1765. [Paroles de M. Chamfort, musique de Mxxx.] Publication :  Paris, impr. de C. Ballard 1765. In-8, 22 p.
Note(s) :   Journal des spectacles représentés devant Leurs Majestés sur les théâtres de Versailles et de Fontainebleau pendant l'année 1765, t. II. [AS]",5088,1,18776,Zénis et Almasie,,,,1765,1765,"Ballard, Christophe-Jean-François I (Imprimerie de C. Ballard)"
1121,326191,Y-5972 (ART 25) < Ancienne cote > support imprimé,Y-5972 (ART 25) < Ancienne cote > ,??,,"[Tolbiac - Rez-de-jardin - magasin] BNF, catalogue :   Zélindor, roi des silphes, ballet héroïque en 1 acte et en vers libres (par Moncrif, musique de Rebel et Francœur). Publication :  Paris : Ballard, 1763, In-8. [AS]",6556,1,18757,"Zélindor, roi des sylphes",,,,1763,1763,"Ballard, Christophe-Jean-François I (Imprimerie de C. Ballard)"
1140,326240,YF-2719 < Vol. 5 > support imprimé,YF-2719 < Vol. 5 > ,http://catalogue.bnf.fr/ark:/12148/cb309580973,,"[Tolbiac - Rez-de-jardin - magasin]
Œuvres de Molière. Nouvelle édition [par M-A. Joly] 
Publication :  Paris : de Heuqueville père, 1739, In-12, pl. (Lacroix, 320.)
Comprend :   […] V. [Amphitryon. L'Avare. George Dandin. Feste de Versailles en 1668 (par A. Félibien).] […] [AS]",4796,1,1355,Amphitryon,,,,1739,1739,
1157,326293,YF-7911 (2) support imprimé,YF-7911 (2) ,http://catalogue.bnf.fr/ark:/12148/cb30749628m,,"[Tolbiac - Rez-de-jardin - magasin] BNF, catalogue : 
Ismène et Isménias, ou la Fête de Jupiter, opéra en 3 actes [par Laujon], représenté devant Leurs Majestés, à Choisy, le lundi 13 et jeudi 16 juin 1763.
Publication :  (Paris,) : impr. de C. Ballard, 1763, In-8, 58 p.
Note(s) :   Journal des spectacles représentés devant Leurs Majestés sur les théâtres de Choisy, Fontainebleau et Versailles, depuis le 13 juin 1763 jusqu'au 29 décembre de la même année. [AS]",5196,1,10659,Ismène et Isménias,ou la Fête de Jupiter,,,1763,1763,"Ballard, Christophe-Jean-François I (Imprimerie de C. Ballard)"
1170,326329,8-YTH-10414 support imprimé / Tolbiac / rez-de-jardin / magasin,8-YTH-10414  / Tolbiac / rez-de-jardin / magasin,http://catalogue.bnf.fr/ark:/12148/cb307785517,,"Auteur(s) :   Le Grand, Marc-Antoine
 Grandval, Charles-François Racot de (fils)
 Titre(s) :   Le Luxurieux, comédie en vers en 1 acte, par le sieur L. G., comédien ordinaire du Roy [Texte imprimé]
 Publication :  (S. l. n. d.)
 Description matérielle :  In-12, 23 p.
 Note(s) :   Attribué à M. A. Legrand ou à C.-F. Ragot de Grandval

 Notice n° : FRBNF30778551",3120,1,11517,Le Luxurieux,ou le Libertin puni,,,1731,1731,
1171,326330,RES-YF-4527 support imprimé / Tolbiac / rez-de-jardin / magasin,RES-YF-4527  / Tolbiac / rez-de-jardin / magasin,http://catalogue.bnf.fr/ark:/12148/cb307785517,,"Auteur(s) :   Le Grand, Marc-Antoine
 Grandval, Charles-François Racot de (fils)
 Titre(s) :   Le Luxurieux, comédie en vers en 1 acte, par le sieur L. G., comédien ordinaire du Roy [Texte imprimé]
 Publication :  (S. l. n. d.)
 Description matérielle :  In-12, 23 p.
 Note(s) :   Attribué à M. A. Legrand ou à C.-F. Ragot de Grandval

 Notice n° : FRBNF30778551",3120,1,11517,Le Luxurieux,ou le Libertin puni,,,1731,1731,
1172,326331,ENFER-721 support imprimé / Tolbiac / rez-de-jardin / magasin,ENFER-721  / Tolbiac / rez-de-jardin / magasin,http://catalogue.bnf.fr/ark:/12148/cb30533728w,http://gallica.bnf.fr/ark:/12148/bpt6k15137690,"Auteur(s) :   Grandval, Charles-François Racot de (fils)
 Titre(s) :   La Nouvelle Messaline, tragédie en 1 acte, par Pyron, dit Prepucius. Se vend à Chaud-Conin et à Babine. Elle est, dit-on, de Granval. L'on y a joint le Sérail de Delis et la
 Description du Temple de Vénus [Texte imprimé]
 Publication :  A Ancone : chez Clitoris, libraire rue du Sperme, vis-à-vis la Fontaine de la Semence, à la Verge d'or, 1773
 Description matérielle :  In-8 ? , 31 p.
 Note(s) :   Attribué à Grandval fils

 Notice n° : FRBNF30533728      [DT]",2536,1,13373,La Nouvelle Messaline,,,,1773,1773,"Clitoris, libraire rue du Sperme, vis-à-vis la Fontaine de la Semence, à la Verge d’Or"
1173,326332,RES-YF-3592 support imprimé / Tolbiac / rez-de-jardin / magasin,RES-YF-3592  / Tolbiac / rez-de-jardin / magasin,http://catalogue.bnf.fr/ark:/12148/cb30533716w,,"Auteur(s) :   Grandval, Charles-François Racot de (1710-1784)

 Titre(s) :   Les Deux biscuits [Texte imprimé], tragedie, traduite de la langue que l'on parloit jadis au royaume d'Astracan, et mise depuis peu en vers franc?ais…
 Publication :  Se vend à Astracan [i.e. Paris], chez un libraire. M.DCC.LII
 Description matérielle :  35 p. ; in-8
 Note(s) :   Par Charles-Franc?ois Ragot de Grandval, qui dévoile son nom, Grandval le fils, par les lettres initiales et finales de la liste des personnages, et d'après Barbier, qui rétablit le
 véritable lieu d'éd. - Front.
 CG, LXIII, 589-590BarbierBrenner 7068

 Notice n° : FRBNF30533716  [DT]",5176,1,6322,Les Deux biscuits,,,,1752,1752,
1174,326333,RES-YF-3598 support imprimé / Tolbiac / rez-de-jardin / magasin,RES-YF-3598  / Tolbiac / rez-de-jardin / magasin,http://catalogue.bnf.fr/ark:/12148/cb30533716w,,"Auteur(s) :   Grandval, Charles-François Racot de (1710-1784)

 Titre(s) :   Les Deux biscuits [Texte imprimé], tragedie, traduite de la langue que l'on parloit jadis au royaume d'Astracan, et mise depuis peu en vers franc?ais…
 Publication :  Se vend à Astracan [i.e. Paris], chez un libraire. M.DCC.LII
 Description matérielle :  35 p. ; in-8
 Note(s) :   Par Charles-Franc?ois Ragot de Grandval, qui dévoile son nom, Grandval le fils, par les lettres initiales et finales de la liste des personnages, et d'après Barbier, qui rétablit le
 véritable lieu d'éd. - Front.
 CG, LXIII, 589-590BarbierBrenner 7068

 Notice n° : FRBNF30533716  [DT]",5176,1,6322,Les Deux biscuits,,,,1752,1752,
1175,326334,8-YTH-4786 support imprimé / Tolbiac / rez-de-jardin / magasin,8-YTH-4786  / Tolbiac / rez-de-jardin / magasin,http://catalogue.bnf.fr/ark:/12148/cb30533716w,,"Auteur(s) :   Grandval, Charles-François Racot de (1710-1784)

 Titre(s) :   Les Deux biscuits [Texte imprimé], tragedie, traduite de la langue que l'on parloit jadis au royaume d'Astracan, et mise depuis peu en vers franc?ais…
 Publication :  Se vend à Astracan [i.e. Paris], chez un libraire. M.DCC.LII
 Description matérielle :  35 p. ; in-8
 Note(s) :   Par Charles-Franc?ois Ragot de Grandval, qui dévoile son nom, Grandval le fils, par les lettres initiales et finales de la liste des personnages, et d'après Barbier, qui rétablit le
 véritable lieu d'éd. - Front.
 CG, LXIII, 589-590BarbierBrenner 7068

 Notice n° : FRBNF30533716   [DT]",5176,1,6322,Les Deux biscuits,,,,1752,1752,
1229,326456,RES-YF-3162 < Ex. 1 > support imprimé,RES-YF-3162 < Ex. 1 > ,http://catalogue.bnf.fr/ark:/12148/cb36582082c,,"[Tolbiac - Rez-de-jardin - magasin] BNF, catalogue : Le Malade imaginaire, comédie meslée de musique et de danses, par Monsieur de Molière… Publication :  (Paris : D. Thierry), 1682, In-16, paginé : 125-261, pl. [AS]",6649,1,11667,Le Malade imaginaire,,,,1682,1682,Thierry
1236,326472,8-Z LE SENNE-10902 (9) support imprimé,8-Z LE SENNE-10902 (9) ,??,,"[Tolbiac - Rez-de-jardin - magasin] BNF, catalogue : 
Palmire. Ballet héroïque en 1 acte représenté devant Leurs Majestés à Fontainebleau le 24 octobre 1765. [Paroles de Chamfort, musique de Bury. - Suivi de La Vengeance de l'amour ou Diane et Endimion, pantomime héroïque en 3 actes, exécuté devant Leurs Majestés à Fontainebleau à la suite de Palmire.] 
Publication :  Paris, impr. de C. Ballard1 765. In-8, 32 p.
Note(s) :   Journal des spectacles représentés devant Leurs Majestés sur les théâtres de Versailles et de Fontainebleau pendant l'année 1765, t. II. [AS]",5087,1,13825,Palmire,,,,1765,1765,"Ballard, Christophe-Jean-François I (Imprimerie de C. Ballard)"
1257,326544,SMITH LESOUEF R-4008 (3) < Ex. 1 > support imprimé,SMITH LESOUEF R-4008 (3) < Ex. 1 > ,http://catalogue.bnf.fr/ark:/12148/cb36578019v,,"Tolbiac - Rez-de-jardin - magasin] BNF, catalogue : Les Travaux d'Ulysse, tragé-comédie tirée d'Homère… par I. G. Durval. Publication :  A Paris : P. Ménard, (1631), In-8°, XVI-190 p. [AS]",6672,1,17735,Les Travaux d’Ulysse,,,,1631,1631,"Ménard, Pierre"
1437,328204,8-BL-12665 (2) < Pièce n° 2.,8-BL-12665 (2) < Pièce n° 2.,http://catalogue.bnf.fr/ark:/12148/cb36063488h,,"[Arsenal - magasin 
8-BL-12665 (2) < Pièce n° 2. Recueil d'œuvres de Boisrobert > support imprimé] BNF, catalogue : Les coups d'amour et de fortune ou L'heureux infortuné : tragi-comédie / [F. Le Métel de Boisrobert]
Publication :  Paris : G. de Luyne, 1656, 86 p. [AS]",6857,1,5648,Les Coups d’Amour et de Fortune,ou l’Heureux infortuné,,,1656,1656,"Luynes, Guillaume de"
1629,330465,8-BL-12942 (1) < Pièce n° 1. Recueil > support imprimé,8-BL-12942 (1) < Pièce n° 1. Recueil > ,http://catalogue.bnf.fr/ark:/12148/cb393336333,,[Arsenal - magasin],7116,1,715,L’Amant qui ne flatte point,,,,1682,1682,"Moëtjens, Adriaen I"
1764,331016,,??,,,"Une nuit de Paris, comédie en un acte ; avec un prologue. Bruxelles, François Foppens, 1740. In-12° de 88 p. [JPhVA]",2670,1,13428,Une Nuit de Paris,,,,1740,1740,"Foppens, François II"
1847,331307,,??,,,"Les Troqueurs. En un acte, représenté à Bruxelles dans le courant du mois de novembre 1753 par les comédiens françois sous les ordres de Son Altesse Royale. (Bruxelles, J.J. Boucherie), 1753. In-8° de 24 p. [JPhVA]",6351,1,18063,Les Troqueurs,,,,1753,1753,"Boucherie, Jean-Joseph"
1859,331356,,??,,,"L’Adieu du trône, ou Diocletian et Maximian, tragedie. Dediée à la reyne de Suede, par le Sieur Du Bosc de Montandré. Bruxelles, François Foppens, 1654. In-4° de 10 fnc.-98 p. [JPhVA]",7273,1,271,L’Adieu du trône,ou Dioclétian et Maximian,,,1654,1654,"Foppens, François I"
1866,331369,,??,,,,7278,1,3074,Ballet des Dieux et des Déesses,,,,1664,1664,"Vivien, Balthazar"
1869,331375,,??,,,"La Devineresse, ou les Faux enchantemens, comédie représentée par la troupe du Roi. Bruxelles, Pierre Marto, 1680. In-8° de 4 fnc.-154 p. [JPhVA]",5014,1,6529,La Devineresse,ou les Faux enchantements,Mme Jobin,,1680,1680,"Marteau, Pierre"
1873,331386,,??,,,"Les Fables d’Esope, comedie, par Mr. Boursault. Suivant la copie de Paris. Bruxelles, Jean Leonard, 1690. In-12° de 118 p. [JPhVA]",7284,1,7942,Les Fables d’Esope,ou Esope à la ville,,,1690,1690,"Léonard, Jean"
1875,331389,,??,,,"Brutus : tragedie. Paris, Veuve de Louis Gonthier ; Bruxelles, Jean Leonard, 1691. In-8° de 64 p. [JPhVA]",7286,1,4075,Brutus,,,,1691,1691,"Léonard, Jean"
1941,331553,,??,,,"Mahomet, tragédie, par M. de Voltaire, représentée sur le théatre de la Comédie françoise à Paris. Nouvelle édition. Bruxelles, s.n., 1752. In-8°, 48 p. [JPhVA]",7329,1,11591,Mahomet,ou le Fanatisme,,,1752,1752,
1947,331562,,??,,,"Les Amours de Bastien et Bastiene, parodie du Devin du village. Par Favart & Harny. Représenté à Bruxelles dans le courant du mois de novembre 1753 par les comediens françois sous les ordres de Son Altesse Royale. La Haye, Pierre Gosse, 1754. In-8°, 14 p. [JPhVA]",7331,1,1203,Les Amours de Bastien et Bastienne,,,,1754,1754,"Gosse, Pierre II (dit Gosse junior)"
2084,331907,,??,,,"On ne s’y attendoit pas, ou les Epoux réunis, comédie-proverbe en un acte et en prose, représentée à la Barriere de Monceaux. Bruxelles ; Paris, Grangé, 1778. In-8°, VIII-63 p., mus. [JPhVA]",5198,1,13593,On ne s’y attendait pas,ou les Epoux réunis,,,1778,1778,Grangé
2088,331967,,??,,,"Le Choix des fées par l’amour et l’hymen, à la naissance de Monseigneur le Dauphin, comédie en un acte, en prose, par Madame de Montanclos. Bruxelles ; Paris, Veuve Duchesne, 1782. In-8°, VI-33 p. [JPhVA]",5221,1,4760,"Le Choix des fées par l’amour et l’hymen, à la naissance de Monseigneur le Dauphin",,,,1782,1782,"Duchesne, Veuve"
2098,331987,,??,,,"L’Intrigue punie, comédie en cinq actes, en prose et à grand spectacle, par M. De L***. Bruxelles ; Paris, Duplain, 1785. In-8°, 96 p. [JPhVA]",5194,1,10562,L’Intrigue punie,,,,1785,1785,Duplain
2118,332231,,??,,,"Scanderberg, tragédie en cinq actes, mutilée sur le théâtre français le 9 mai 1786, et ensuite dévorée par les journalistes. Bruxelles ; Paris, Desenne, 1786. In-8°, XVI-96 p. [JPhVA]",7416,1,16530,Scanderberg,,,,1786,1786,Desenne
2157,332763,,??,,,,5022,1,7027,Dupuis et Desronais,,Dupuis et Des Ronais,,1773,1773,"Duchesne, Nicolas-Bonaventure"
2357,339202,,??,,,"Le Grand dénouement de la constitution, parodie politico-tragi-comique, jouée à Bruxelles, le 1er janvier 1791. Par l'auteur de la Guinguette partriotique [Beaunoir]. Bruxelles, 1791. In-8° de 45 p. [JPhVA]",7570,1,9416,Le Grand dénouement de la constitution,,,,1791,1791,
2513,361154,Tolbiac / rez-de-jardin / magasin 8-YTH-10437,Tolbiac / rez-de-jardin / magasin 8-YTH-10437,http://catalogue.bnf.fr/ark:/12148/cb30830326w,,"[support : livre] Ma tante Aurore, ou Le roman impromptu, opéra bouffon [par Ch. de Longchamps], sifflé en 3 actes le 23 nivôse, applaudi en 2, le 25 du même mois au théâtre Feydeau. 
Paris : Barba, an XI-1803, 1 vol. (VI-69 p.) ; in-8.",7665,1,11535,Ma Tante Aurore,ou le Roman impromptu,,,1803,1803,"Barba, Jean-Nicolas"
2547,394597,YE-9102 (-9106),YE-9102 (-9106),http://catalogue.bnf.fr/ark:/12148/cb312569166,http://gallica.bnf.fr/ark:/12148/bpt6k209397j,"[Tolbiac - Rez-de-jardin - magasin] BNF, catalogue : 
Œuvres de J.-B. Rousseau / nouv. éd., avec un commentaire historique et littéraire, précédé d'un nouvel essai sur la vie et les écrits de l'auteur. Paris : Lefèvre, 1820, 5 vol.; in-8. [AS]",4792,1,11702,La Mandragore,,,,1820,1820,
790,320485,YF-3700 < Vol. 5 > support imprimé,YF-3700 < Vol. 5 > ,http://catalogue.bnf.fr/ark:/12148/cb31051784k,,"[Tolbiac - Rez-de-jardin - magasin] BNF, catalogue : Œuvres de théâtre de MM. de Brueys et de Palaprat. Nouvelle édition… [par d'Alençon.] 
Paris : Briasson, 1755-1756, 5 vol. in-12, portr. Tome V : Par M. de Palaprat : Le Ballet extravagant. Le Secret révélé. La Prude du temps. Poésies diverses",4824,1,3330,Ballet extravagant,,,,1755,1756,Briasson
791,320487,YF-10547 < Vol. 1 > support imprimé,YF-10547 < Vol. 1 > ,http://catalogue.bnf.fr/ark:/12148/cb310517806,,"[Tolbiac - Rez-de-jardin - magasin] BNF, catalogue : Les Œuvres de M. de Palaprat. Nouvelle édition, augmentée de plusieurs comédies qui n'ont pas encore été imprimées ; d'un recueil de pièces en vers, adressées à Mgr le duc de Vendome, et de divers essais de différentes poésies, avec une lettre à M. B. P. M. D. M. [Mr. Boudin, premier médecin de Madame la Dauphine.] contenant quelques légères observations sur une devise… Paris : P. Ribou, 1711, 2 vol. in-12, pl. 
Volume I. Le Concert ridicule. Le Ballet extravagant. Le Secret révélé. Le Grondeur. Le Muet. [AS]",45,1,3330,Ballet extravagant,,,,1711,1711,"Ribou, Pierre"
792,320489,YF-10547 < Vol. 1 > support imprimé,YF-10547 < Vol. 1 > ,http://catalogue.bnf.fr/ark:/12148/cb31051781j,,"[Tolbiac - Rez-de-jardin - magasin] BNF, catalogue : Les Œuvres de M. de Palaprat. Nouvelle édition, augmentée de plusieurs comédies qui n'ont pas encore été imprimées ; d'un recueil de pièces en vers, adressées à Mgr le duc de Vendome, et de divers essais de différentes poésies, avec une lettre à M. B. P. M. D. M. [Mr. Boudin, premier médecin de Madame la Dauphine.] contenant quelques légères observations sur une devise… Paris : P. Ribou, 1712, 2 vol. in-12.
Volume I : Le Concert ridicule. Le Ballet extravagant. Le Secret révélé. Le Grondeur. Le Muet. [AS]",46,1,3330,Ballet extravagant,,,,1712,1712,"Ribou, Pierre"
877,321703,4-BL-3507 (1) < Pièce n° 1. Recueil > support imprimé,4-BL-3507 (1) < Pièce n° 1. Recueil > ,http://catalogue.bnf.fr/ark:/12148/cb360595343,http://gallica.bnf.fr/ark:/12148/bpt6k82897h,"[Arsenal - magasin] BNF, catalogue : La stratonice ou Le malade d'amour : tragi-comédie / [signé Brosse]
Paris : A. de Sommaville : A. Courbé, 1644, [8]-132 p. [AS]",8015,1,17090,Stratonice,ou le Malade d’amour,,,1644,1644,"Sommaville, de/Courbé"
2548,395560,,,,,,5029,1,7587,L’Envieux (comédie en 5 actes et en vers […] Non imprimée [Texte imprimé ]),,,,,,
2552,412122,,,,,,5025,1,7174,Les Ecriteaux des fêtes parisiennes,,,,1712,1712,"Valleyre, Guillaume-Amable I"
