id,original_id,publication_id,call_number,description,cesar_title,bnf_main_title,score_main_comp,bnf_modernised_title,score_modern_comp,date,date_match,editor,bnf_uri,gallica_uri
63,306740,5429,"8-YTH-14325, Tolbiac / rez-de-jardin / magasin",,Le Plaisir sage et réglé,,,,,1826,,Libraires du Palais-Royal,http://catalogue.bnf.fr/ark:/12148/cb300004683,
253,307478,5562,YF-7507 support imprimé,"[Tolbiac - Rez-de-jardin - magasin] L'Ombre de son rival, comédie mêlée de musique et de danses. (Signé : Crosnier.) La Haye : Rammazeyn, 1681, In-12, VIII-35 p.",L’Ombre de son rival,,,,,1681,,Rammazeyn,http://catalogue.bnf.fr/ark:/12148/cb302885627,
355,307874,5653,YF-801 support imprimé,"[Tolbiac - Rez-de-jardin - magasin] Théonoé, tragédie… [Paroles de Laroque, musique de Salomon. Académie royale de musique, novembre 1715.] Paris : P. Ribou, 1715, In-4, XX-58 p. et privilège.",Théonoé,,,,,1715,,"Ribou, Pierre",http://catalogue.bnf.fr/ark:/12148/cb30743235b,
375,307938,5672,YD-5731 support imprimé,"[Tolbiac - Rez-de-jardin - magasin] La Philis de Scire, pastorale du comte Bonnarelli, nouvellement traduite en vers françois (par l'abbé de Torche), avec l'italien à costé.
Paris : E. Loyson, 1669, In-12, XXIV-383 p.",Philis de Scire,,,,,1669,,"Loyson, Étienne",http://catalogue.bnf.fr/ark:/12148/cb339867518,
389,308038,5689,MICROFICHE M-10788 support imprimé,"[Tolbiac - Rez-de-jardin - magasin] Rosemonde ou La vengeance : tragédie / par N. Chrestien, seigneur Des Croix,…
Rouen : T. Reinsart, 1603, 123 p.",Rosemonde ou la Vengeance,,,,,1603,,"Reinsart, Théodore",http://catalogue.bnf.fr/ark:/12148/cb36053081s,"
http://gallica.bnf.fr/ark:/12148/bpt6k61736c
"
436,308167,5723,YF-7823 support imprimé,"[Tolbiac - Rez-de-jardin - magasin] Phaéton, tragédie en musique représentée par l'Académie royale de musique devant S. M., à Versailles, le 6e jour de janvier 1683. Imprimé à Paris, et on les vend à Anvers : chez H. Van Dunwaldt, 1687, In-12, 59 p.",Phaéton,,,,,1687,,,http://catalogue.bnf.fr/ark:/12148/cb31164682q,
437,308169,5724,YF-7781 support imprimé,"[Tolbiac - Rez-de-jardin - magasin] Phaéton, tragédie en musique représentée par l'Académie royale de musique devant S. M., à Versailles, le 6e jour de janvier 1683. Amsterdam : chez les héritiers de A. Schelte, 1698, In-12, 58 p., frontisp. gr.
Note(s) :   Recueil des opéras, T. 2.",Phaéton,,,,,1698,,"Schelte, Héritiers de A.",http://catalogue.bnf.fr/ark:/12148/cb311646832,
439,308174,5726,8-YTH-14055 support imprimé,"[Tolbiac - Rez-de-jardin - magasin] 
Phaéton, tragédie en musique représentée par l'Académie royale de musique. [Paroles de Quinault, musique de Lulli.] Lyon : T. Amaulry, 1689, In-12, 48 p.",Phaéton,,,,,1689,,"Amaulry, Thomas",http://catalogue.bnf.fr/ark:/12148/cb31164684d,
441,308178,5728,RES-YF-1185 support imprimé,"[Tolbiac - Rez-de-jardin - magasin] Phaéton, tragédie… remise au théâtre… le… 11 novembre 1721. [Paroles de Quinault, musique de Lulli.] Paris : Vve de P. Ribou, 1721, In-4, XII-59 p.",Phaéton,,,,,1721,,"Ribou, Veuve Pierre",http://catalogue.bnf.fr/ark:/12148/cb31164688s,
454,308210,5741,RES-YF-1052 support imprimé,"[Tolbiac - Rez-de-jardin - magasin] :   Proserpine, tragédie remise au théâtre par l'Académie royale de musique, le… 7e mars 1715. [Paroles de Quinault, musique de Lulli.] 
Paris : P. Ribou, 1715, In-4, XVI-65 p.",Proserpine,,,,,1715,,"Ribou, Pierre",http://catalogue.bnf.fr/ark:/12148/cb311647046,"
http://gallica.bnf.fr/ark:/12148/bpt6k15216573
"
470,308263,5757,RES-YF-1929 support imprimé,"[Tolbiac - Rez-de-jardin - magasin]  Castor et Pollux, tragédie représentée pour la première fois par l'Académie royale de musique le 24 octobre 1737 et remise au théâtre le 8 janvier 1754. Paris : aux dépens de l'Académie, imp. de Vve Delormel et fils, 1754, In-4.",Castor et Pollux,,,,,1754,,"Delormel, Veuve et fils",http://catalogue.bnf.fr/ark:/12148/cb332822700,"
http://gallica.bnf.fr/ark:/12148/bpt6k15140657
"
481,308297,5767,YF-745 support imprimé,"[Tolbiac - Rez-de-jardin - magasin] Psyché, tragédie représentée par l'Académie royale de musique. [Paroles de Th. Corneille et Fontenelle, musique de Lulli.] Paris : aux dépens de l'Académie, impr. de R. Baudry, 1678, In-4, 7 ff. non ch., 59 p.",Psyché,,,,,1678,,"Baudry, René",http://catalogue.bnf.fr/ark:/12148/cb30448248c,"
http://gallica.bnf.fr/ark:/12148/bpt6k1521631v
"
482,308301,5770,YF-770 support imprimé,"[Tolbiac - Rez-de-jardin - magasin] Le Temple de la Paix, ballet dansé devant S. M., à Fontainebleau, le [15.] d'octobre 1685. Paris : impr. de C. Ballard, 1685, In-4, II-36 p.",Le Temple de la paix,,,,,1685,,"Ballard, Christophe",http://catalogue.bnf.fr/ark:/12148/cb31164744f,"
http://gallica.bnf.fr/ark:/12148/bpt6k1522047z
"
523,308468,5241,8-YTH-6562 support imprimé,"[Tolbiac - Rez-de-jardin - magasin] La Fausse délicatesse, comédie en 5 actes en prose, traduite de l'anglois, jouée pour la première fois sur le Théâtre royal en février 1768. Paris : Vve Duchesne, 1768, In-8, IV-99 p.",La Fausse délicatesse,,,,,1768,,"Duchesne, Veuve",http://catalogue.bnf.fr/ark:/12148/cb31124521d,
589,317998,5884,RES-YF-3125 support imprimé,"[Tolbiac - Rez-de-jardin - magasin] 
Le Fantosme amoureux, tragi-comédie de M. Quinault. Amsterdam : A. Schelte, 1697, In-12, IV-77 p. [AS]",Le Fantôme amoureux,,,,,1697,,Schelte,http://catalogue.bnf.fr/ark:/12148/cb311645159,
590,318000,5885,RES-YF-4063 support imprimé,"[Tolbiac - Rez-de-jardin - magasin] Le Fantosme amoureux, tragi-comédie (imitée de Calderon) de M. Quinault. (S. l.,) : suivant la copie imprimée à Paris, 1658, In-12, 96 p. [AS]",Le Fantôme amoureux,,,,,1658,,,http://catalogue.bnf.fr/ark:/12148/cb301862424,
609,318070,5904,YF-886 support imprimé,"[Tolbiac - Rez-de-jardin - magasin] Les Fêtes de Thalie, ballet… remis au théâtre le… 29 juin 1745. [Paroles de J. de Lafont, musique de Mouret.] Paris : impr. de J.-B.-C. Ballard, 1745, In-4, 52 p. [AS]",Les Fêtes de Thalie,,,,,1745,,"Ballard, Jean-Baptiste-Christophe",http://catalogue.bnf.fr/ark:/12148/cb30715260d,"
http://gallica.bnf.fr/ark:/12148/bpt6k62332071
"
658,318474,5967,RES-YF-2424 support imprimé,"[Tolbiac - Rez-de-jardin - magasin] BNF, catalogue : Tancrede, tragedie représentée pour la premiere fois par l'Academie royale de musique, le septiéme jour de novembre 1702. Remise au théatre le jeudy vingtième octobre 1707.
Publication :  A Paris, chez Christophe Ballard. M.DCCVII 
XVI-52 p. ; in-8.
Note(s) :   Par Antoine Danchet. - Armoiries royales au titre. - En cinq actes et en vers; précédé d'un prologue. [AS]",Tancrède,,,,,1707,,"Ballard, Christophe",http://catalogue.bnf.fr/ark:/12148/cb33621607j,
661,318480,5970,RES-YF-2427 support imprimé,"[Tolbiac - Rez-de-jardin - magasin] BNF, catalogue : Tancrède, tragédie (paroles de Danchet, musique de Campra). (Paris, Académie royale de musique, 7 novembre 1702.) 
Publication :  (Paris,) : impr. de J.-B.-C. Ballard, 1738, 
In-4, 69 p. [AS]",Tancrède,,,,,1738,,"Ballard, Jean-Baptiste-Christophe",http://catalogue.bnf.fr/ark:/12148/cb30297597v,"
http://gallica.bnf.fr/ark:/12148/bpt6k1522017t
"
671,318555,5978,RES-YF-1437 support imprimé,"[Tolbiac - Rez-de-jardin - magasin] BNF, catalogue : Isis, tragédie… remise au théâtre… pour la troisième fois, le mardi quatorze septembre 1717. [Paroles de Quinault, musique de Lulli.] Publication :  Paris : P. Ribou, 1717, In-4, XIV-58 p.
Note(s) :   Une correction ms. donne la date du ""mercredy quinzième"" septembre pour la 3e reprise. - Rel. mar. r. aux armes de la Dsse d'Orléans. [AS]",Isis,,,,,1717,,"Ribou, Pierre",http://catalogue.bnf.fr/ark:/12148/cb31164661r,
672,318557,5979,YF-7776 support imprimé,"[Tolbiac - Rez-de-jardin - magasin] Isis, tragédie en musique… Publication :  (Paris 1686.) [AS]",Isis,,,,,1686,,,http://catalogue.bnf.fr/ark:/12148/cb334388754,
705,318806,6027,RES-YF-2494 support imprimé,"[Tolbiac - Rez-de-jardin - magasin] BNF, catalogue : Vénus et Adonis, tragédie [de J.-B. Rousseau] représentée pour la première fois par l'Académie royale de musique l'an 1697, remise au théâtre pour la seconde fois le mardi 17 août 1717. Publication :  Paris : Ribou, 1717, In-4, XIV-54 p. [AS]",Vénus et Adonis,,,,,1717,,Ribou,http://catalogue.bnf.fr/ark:/12148/cb31257045j,
799,320503,4862,YF-4985 support imprimé,"[Tolbiac - Rez-de-jardin - magasin] BNF, catalogue : Le Muet, comédie [imitée de l'Eunuque de Térence]. [Paris, Théâtre Français, 22 juin 1691.] Paris : au bureau de la ""Petite bibliothèque des théâtres"", 1786, In-24. ij-XIV-139 p.
Note(s) :   Petite bibliothèque des théâtres. - Chefs-d'œuvre de Brueys. [AS]",Le Muet,,,,,1786,,,http://catalogue.bnf.fr/ark:/12148/cb31051835n,
862,321660,6259,8-YTH-867 support imprimé,"[Tolbiac - Rez-de-jardin - magasin] BNF, catalogue : L'Andrienne, comédie [de Térence, traduite en vers français] par M. Baron.  Paris : Vve de P. Ribou, 1729, In-12, 105 p. et le privilège. [AS]",L’Andrienne,,,,,1729,,"Ribou, Veuve Pierre",http://catalogue.bnf.fr/ark:/12148/cb31443796j,
906,321760,6301,YF-11562 support imprimé,"[Tolbiac - Rez-de-jardin - magasin] BNF, catalogue : Le Gardien de soi-même, comédie de M. Scarron (imitée de Calderon)
Publication :  Paris, A. de Sommaville, 1655, In-12. [AS]",Le Gardien de soi-même,,,,,1655,,"Sommaville, Antoine de",http://catalogue.bnf.fr/ark:/12148/cb30186156j,
969,324717,6422,YF-4906 support imprimé,"[Tolbiac - Rez-de-jardin - magasin] BNF, catalogue : Horace, tragédie (par P. Corneille)
Publication :  Paris : au bureau de la Petite Bibliothèque des théâtres, 1785.
Description matérielle :  In-8, XXX-86 p.
Note(s) :   Petite Bibliothèque des théâtres.

Notice n° : FRBNF30271643. [AS]",Horace,,,,,1785,,Bureau de la Petite Bibliotheque des théâtres,http://catalogue.bnf.fr/ark:/12148/cb30271643b,
1050,325890,821,RES-YF-1530 support imprimé,"[Tolbiac - Rez-de-jardin - magasin] BNF, catalogue : La Toison d'or, tragédie lyrique en trois actes représentée pour la première fois à Paris sur le théâtre de l'Académie royale de musique le mardi 29 août 1786. Publication :  Paris : imp. de P. de Lormel, 1786, In-4. [AS]",La Toison d’or,,,,,1786,,"Delormel, Pierre-Nicolas",http://catalogue.bnf.fr/ark:/12148/cb33626799h,
1088,326086,6532,RES-YF-2993 support imprimé,"[Tolbiac - Rez-de-jardin - magasin] BNF, catalogue : 
Nicomède, tragédie. (Par P. Corneille.) Publication :  Suivant la copie imprimée à Paris 1663, In-12, 68 p., front. gravé. (Picot, 357.) [AS]",Nicomède,,,,,1663,,,http://catalogue.bnf.fr/ark:/12148/cb30271765x,
1094,326126,6538,RES-YF-2991 support imprimé,"[Tolbiac - Rez-de-jardin - magasin] BNF, catalogue : Médée, tragédie (de P. Corneille). Publication :  Suivant la copie imprimée à Paris 1664, In-12, 56 p., front. gravé. (Picot, 271.)
Note(s) :   Théâtre de P. Corneille [Amsterdam], 1664. T. I. [AS]",Médée,,,,,1664,,,http://catalogue.bnf.fr/ark:/12148/cb30271710n,
1105,326147,5234,8-YTH-20391 support imprimé,"[Tolbiac - Rez-de-jardin - magasin] BNF, catalogue : Médée, tragédie en 5 actes… Publication :  (Dresde 1764.) 
Autre(s) auteur(s) :   Longepierre, Hilaire-Bernard de (1659-1731). [AS]",Médée,,,,,1764,,,http://catalogue.bnf.fr/ark:/12148/cb33476401t,
1128,326211,6565,YF-4914 support imprimé,"[Tolbiac - Rez-de-jardin - magasin] BNF, catalogue :   Othon, tragédie par P. Corneille.
Publication :  Paris : au bureau de la Petite Bibliothèque des théâtres, 1785, In-8, IX-91 p. [AS]",Othon,,,,,1785,,Bureau de la Petite Bibliotheque des théâtres,http://catalogue.bnf.fr/ark:/12148/cb30271815n,
1160,326298,5193,RES-YF-1182 support imprimé,"[Tolbiac - Rez-de-jardin - magasin] BNF, catalogue : Omphale, tragédie [par A. Houdar de La Motte]… remise au théâtre le [ ] mars 1721. Publication :  Paris : Vve de P. Ribou, 1721, In-4, XII-48 p. [AS]",Omphale,,,,,1721,,"Ribou, Veuve Pierre",http://catalogue.bnf.fr/ark:/12148/cb30730076f,
1162,326302,6592,RES-YF-2299 support imprimé,"[Tolbiac - Rez-de-jardin - magasin] BNF, catalogue : 
Omphale, tragédie [par A. Houdar de La Motte], représentée… pour la 3e [fois] le 27 janvier 1733. Publication :  Paris : impr. de J.-B.-C. Ballard, 1733, In-4, XII-48 p. [AS]",Omphale,,,,,1733,,"Ballard, Jean-Baptiste-Christophe",http://catalogue.bnf.fr/ark:/12148/cb30730077s,
1193,326374,6616,YF-471 support imprimé,"[Tolbiac - Rez-de-jardin - magasin] BNF, catalogue : Didon, tragédie par M. de Scudéry. Publication :  Paris : A. Courbé, 1637,
In-4, pièces limin., 107 p., frontisp. gr. [AS]",Didon,,,,,1637,,"Courbé, Augustin",http://catalogue.bnf.fr/ark:/12148/cb313417439,
1250,326503,6666,RES-YF-1922 support imprimé,"[Tolbiac - Rez-de-jardin - magasin] BNF, catalogue :   Le Carnaval mascarade. Représenté par l'Académie royale de musique.
Publication :  Paris : aux dépens de l'Académie, imp. de R. Baudry, 1675, In-4. [AS]","Le Carnaval, mascarade",,,,,1675,,"Baudry, René",http://catalogue.bnf.fr/ark:/12148/cb33281050k,
1251,326505,6667,YF-7816 support imprimé,"[Tolbiac - Rez-de-jardin - magasin] BNF, catalogue : Le Carnaval, mascarade représentée par l'Académie royale de musique. 
Publication :  Amsterdam : chez les héritiers d'A. Schelte, 1699, In-12. Note(s) :   Paroles de différents auteurs, musique de Lully, d'après le duc de La Vallière. - Recueil des opéras. Tome 7. [AS]","Le Carnaval, mascarade",,,,,1699,,"Schelte, Héritiers de A.",http://catalogue.bnf.fr/ark:/12148/cb33281049c,
1261,326635,6676,YF-11157 support imprimé,"[Tolbiac - Rez-de-jardin - magasin] BNF, catalogue : 
Le Tuteur dupé, comédie en 5 actes et en prose, sujet tiré de Plaute, acte deuxième du Soldat fanfaron, par M. Cailhava d'Estandoux… (Comédiens français ordinaires du roi, 30 septembre 1765.) Publication :  Paris : Vve Duchesne, 1765, In-8, 69 p. [AS]",Le Tuteur dupé,,,,,1765,,"Duchesne, Veuve",http://catalogue.bnf.fr/ark:/12148/cb30184725f,
1263,326639,6678,YF-7698 support imprimé,"[Tolbiac - Rez-de-jardin - magasin] BNF, catalogue : Le Tuteur dupé, comédie en 5 actes et en prose, sujet tiré de Plaute, acte deuxième du Soldat fanfaron, par M. Cailhava d'Estandoux… (Comédiens français ordinaires du roi, 30 septembre 1765.) Publication :  Paris : Vve Duchesne, 1765, In-12, 107 p. [AS]",Le Tuteur dupé,,,,,1765,,"Duchesne, Veuve",http://catalogue.bnf.fr/ark:/12148/cb30184726s,
1286,327413,6709,8-YF-466 (1) support imprimé,"[Tolbiac - Rez-de-jardin - magasin] BNF, catalogue : Érigone : ballet, représenté devant le Roy, sur le Théâtre des petits appartemens, à Versailles / [paroles de Leclerc de La Bruère, musique de Mondonville]
Titre d'ensemble :  Recueil des comédies et ballets représentés sur le Théâtre des petits appartemens, pendant l'hiver de 1747 à 1748. N I.
Publication :  (S. l.,) : Imprimée par exprès commandement de Sa Majesté, 1748, 22 p. ; In-8°. [AS]",Erigone,,,,,1748,,,http://catalogue.bnf.fr/ark:/12148/cb30766287q,
1287,327415,6710,8-YTH-6135 support imprimé,"[Tolbiac - Rez-de-jardin - magasin] BNF, catalogue : 
Érigone, ballet… [Paroles de Leclerc de La Bruère, musique de Mondonville.] [Versailles, Théâtre des petits appartemens, 21 mars 1748 et 3 février 1750.] Publication :  (S. l.,) 1750, In-8, 19 p. [AS]",Erigone,,,,,1750,,,http://catalogue.bnf.fr/ark:/12148/cb307662882,"
http://gallica.bnf.fr/ark:/12148/bpt6k3127780
"
1310,327497,6737,YF-4956 support imprimé,"[Tolbiac - Rez-de-jardin - magasin] BNF, catalogue :   Alcibiade, comédie en 3 actes et en vers, de Ph. Poisson. Publication :  Paris : au bureau de la Petite bibliothèque des théâtres, 1784, In-24, II-VIII-66 p.
Note(s) :   Petite bibliothèque des théâtres. [AS]",Alcibiade,,,,,1784,,Bureau de la Petite Bibliotheque des théâtres,http://catalogue.bnf.fr/ark:/12148/cb31129175f,
1336,327556,6764,8-YTH-7492 support imprimé,"[Tolbiac - Rez-de-jardin - magasin] BNF, catalogue : Le Fou raisonnable, ou l'Anglois, comédie. [Paris, Théâtre des Variétés amusantes, à la Foire St-Laurent, 9 juillet 1781.] Par un anonyme [Patrat] Publication :  Paris : J.-F. Bastien, 1781, In-8, 63 p. [AS]",Le Fou raisonnable ou l’Anglais,,,,,1781,,"Bastien, J.-F.",http://catalogue.bnf.fr/ark:/12148/cb310666852,
1374,327766,6800,YF-4916 support imprimé,"[Tolbiac - Rez-de-jardin - magasin] BNF, catalogue : Ariane, tragédie, par T. Corneille. Publication :  Paris : au bureau de la ""Petite Bibliothèque des théâtres"", 1786, In-8, VI-84 p.
Note(s) :   Petite Bibliothèque des théâtres. [AS]",Ariane,,,,,1786,,Bureau de la Petite Bibliotheque des théâtres,http://catalogue.bnf.fr/ark:/12148/cb30272165h,
1405,328116,5235,YF-881 support imprimé,"[Tolbiac - Rez-de-jardin - magasin] BNF, catalogue : 
Le Parnasse, ballet à l'occasion de la naissance de Monseigneur le Dauphin, donné au Roi, sur la cour de marbre à Versailles, le cinquième jour d'octobre 1729… Publication :  (Paris,) : impr. de J.-B.-C. Ballard, [1729 ?] In-4, 24 p.
Note(s) :   Arrangé par Blamont et Pellegrin. [AS]",Le Parnasse,,,,,1729,,"Ballard, Jean-Baptiste-Christophe",http://catalogue.bnf.fr/ark:/12148/cb31075038v,
1479,328551,6884,RES-YF-1919 support imprimé,"[Tolbiac - Rez-de-jardin - magasin] BNF, catalogue  :   Le Carnaval et la Folie, comédie-ballet [par A. Houdar de La Motte] représentée par l'Académie royale de musique… le 7e aoust 1738.
Publication :  Paris : impr. de J.-B.-C. Ballard, 1738, In-4, 52 p. [AS]",Le Carnaval et la folie,,,,,1738,,"Ballard, Jean-Baptiste-Christophe",http://catalogue.bnf.fr/ark:/12148/cb307300068,"
http://gallica.bnf.fr/ark:/12148/bpt6k1513501q
"
1487,328583,6891,YF-6971 support imprimé,"[Tolbiac - Rez-de-jardin - magasin] BNF, catalogue : 
La Célimène, comédie de Rotrou, accommodée au théâtre [par Tristan L'Hermite], sous le tiltre d'Amarillis, pastorale.
Publication :  Imprimée à Rouen et se vend à Paris : chez G. de Luyne, 1661, In-12, I-80 p. (A. Carriat, XXVII, d.) [AS]",Amarillis,,,,,1661,,"Luynes, Guillaume de",http://catalogue.bnf.fr/ark:/12148/cb31497237n,
1514,328756,6920,YF-11366 support imprimé,"[Tolbiac - Rez-de-jardin - magasin] BNF, catalogue : 
Coriolan, tragédie en 5 actes et en vers, représentée pour la première fois à Paris, par les Comédiens français, le 2 mars 1784… Par M. de La Harpe,… Publication :  Paris : Belin, 1784, In-8, XX-62 p. [AS]",Coriolan,,,,,1784,,Belin,http://catalogue.bnf.fr/ark:/12148/cb307200271,
1666,330779,7156,YF-6628 support imprimé,"[Tolbiac - Rez-de-jardin - magasin] BNF, catalogue : 
 Polixène, tragédie [par A. de La Fosse d'Aubigny] Publication :  Paris : T. Guillain, 1696, In-12, pièces limin., 76 p. [AS]",Polixène,,,,,1696,,"Guillain, Thomas",http://catalogue.bnf.fr/ark:/12148/cb307169492,
1668,330783,7158,YF-9710 support imprimé,"[Tolbiac - Rez-de-jardin - magasin] BNF, catalogue : Polixène, tragédie [par A. de La Fosse d'Aubigny] 
Publication :  Paris : P. Ribou, 1706, In-12, pièces limin., 96 p. [AS]",Polixène,,,,,1706,,"Ribou, Pierre",http://catalogue.bnf.fr/ark:/12148/cb307169508,
1674,330793,7162,YF-9721 support imprimé,"[Tolbiac - Rez-de-jardin - magasin] BNF, catalogue : Corésus et Callirhoé, tragédie, par M. de La Fosse. Publication :  Paris : P. Ribou, (1719.) In-12, IV-64 p. [AS]",Corésus et Callirhoé,,,,,1719,,"Ribou, Pierre",http://catalogue.bnf.fr/ark:/12148/cb30716926d,
1678,330834,8028,RES-YF-831 support imprimé,"[Tolbiac - Rez-de-jardin - magasin] BNF, catalogue : Zéphire et Flore, opéra représenté par l'Académie royale de musique. [Paroles de M. Du Boullay, musique de Louis et Jean Lully.] 
Publication :  Paris : P. Ribou, 1715, In-4, 44 p. [AS]",Zéphire et Flore,,,,,1715,,"Ribou, Pierre",http://catalogue.bnf.fr/ark:/12148/cb303608966,
1679,330836,8029,RES-YF-1202 support imprimé,"[Tolbiac - Rez-de-jardin - magasin] BNF, catalogue : 
Zéphire et Flore, opéra représenté par l'Académie royale de musique. [Paroles de M. Du Boullay, musique de Louis et Jean Lully.] Publication :  Paris : aux dépens de l'Académie, 1688, In-4, 52 p. [AS]",Zéphire et Flore,,,,,1688,,Aux dépens de l’Opéra,http://catalogue.bnf.fr/ark:/12148/cb30360894h,
2344,338617,7560,8-YTH-4582 support imprimé,"[Tolbiac - Rez-de-jardin - magasin] BNF, catalogue :  Démocritte prétendu fou, comédie en 3 actes (par Jacques Autreau). (Paris, Hôtel de Bourgogne, 24 avril 1730.) Publication :  La Haye : A. Van Dole, 1733, In-8. [AS]",Démocrite prétendu fou,,,,,1733,,"Dole, Antoine van",http://catalogue.bnf.fr/ark:/12148/cb30040903q,"
http://gallica.bnf.fr/ark:/12148/bpt6k3040572w
"
2345,338619,7561,YF-5092 support imprimé,"[Tolbiac - Rez-de-jardin - magasin] BNF, catalogue :  Démocritte prétendu fou, comédie en 3 actes (par Jacques Autreau). (Paris, Hôtel de Bourgogne, 24 avril 1730.) Paris : au bureau de la ""Petite Bibliothèque des théâtres"", 1785, In-24, VIII-103 p. [AS]",Démocrite prétendu fou,,,,,1785,,Bureau de la Petite Bibliothèque des Théâtres,http://catalogue.bnf.fr/ark:/12148/cb31603371m,
2515,361311,4346,RES-YF-751,"[Tolbiac - Rez-de-jardin - magasin, support : livre] BNF, catalogue: Péronne sauvée, opéra en 4 actes… (paroles de L.-E. Billardon de Sauvigny, musique de Dezède.) (Académie royale de musique, 27 mai 1783.) Paris : impr. de P. de Lormel, 1783, In-4, 65 p.",Péronne sauvée,,,,,1783,,"Delormel, Pierre-Nicolas",http://catalogue.bnf.fr/ark:/12148/cb30105511s,
2525,362605,7680,RES-YF-1108,"[Tolbiac - Rez-de-jardin - magasin, support : livre] BNF, catalogue :
Psyché, tragédie représentée par l'Académie royale de musique pour la première fois le 19 avril 1678, remise au théâtre le 8 juin 1703. Publication :  Paris : imp. de C. Ballard, 1703, In-4.",Psyché,,,,,1703,,"Ballard, Christophe",http://catalogue.bnf.fr/ark:/12148/cb335576210,
2528,362611,7683,YF-745,"[Tolbiac - Rez-de-jardin - magasin, support : livre] BNF, catalogue :  Psyché, tragédie représentée par l'Académie royale de musique. [Paroles de Th. Corneille et Fontenelle, musique de Lulli.] 
Publication :  Paris : aux dépens de l'Académie, impr. de R. Baudry, 1678, In-4, 7 ff. non ch., 59 p.",Psyché,,,,,1678,,"Baudry, René",http://catalogue.bnf.fr/ark:/12148/cb30448248c,"
http://gallica.bnf.fr/ark:/12148/bpt6k1521631v
"
717,319461,8012,8-YTH-16678 support imprimé,"[Tolbiac - Rez-de-jardin - magasin] BNF, catalogue :   Sophie Francourt, comédie en 4 actes et en prose [par le Mis de La Salle]… [Paris, Comédiens italiens ordinaire du Roi, 18 février 1783.] Publication :  Paris : Brunet, 1783, In-8, 86 p. [AS]",Sophie et Francourt,,,,,1783,,Brunet,http://catalogue.bnf.fr/ark:/12148/cb307449732,
860,321656,5049,8-YTH-8573 support imprimé,"[Tolbiac - Rez-de-jardin - magasin] BNF, catalogue : 
L'Homme à bonne fortune, comédie (par Baron). 
Paris : aux dépens de la Compagnie des imprimeurs-libraires, 1758, 
In-8, 86 p. [AS]",L’Homme à bonnes fortunes,,,,,1758,,Aux dépens de la communauté des imprimeurs-libraires,http://catalogue.bnf.fr/ark:/12148/cb30058418h,
1815,331156,210,RES-YF-1105 support imprimé,"[Tolbiac - Rez-de-jardin - magasin] BNF, catalogue : Fragments de M. de Lully, ballet (paroles de Danchet, musique de Campra). (Paris, Académie royale de musique, 10 septembre 1702.) 
Publication :  Paris : impr. de C. Ballard, 1702, In-4, 47 p. [AS]",Fragments de Mr de Lulli,,,,,1702,,"Ballard, Christophe",http://catalogue.bnf.fr/ark:/12148/cb30297567x,
