pond.area	veg.area	pH	Conduc	BOD	hardness	Alkali	Phospha	Nitra	turbi	maxdep
Q	1380	187	38	215	8	21	2	1	1	0.8	7
P	87	35	40	125	7	14	3	1	1	3.6	4.5
R	63	63	42	110	21	15	5	1	1	0.6	2.5
J	472	407	47	150	14	24	2	7	1	1	6.5
E	23	23	50	150	15	32	3	6	2	3	3
C	67	67	55	145	20	26	13	4	4	15	3
D	100	100	55	150	17	26	13	5	4	10	2
K	292	38	60	180	35	34	16	3	1	15	4.5
B	80	80	65	255	29	50	42	4	2	15	3
A	72	72	65	295	31	90	42	7	5	20	3
G	323	227	68	310	34	64	53	8	6	5.5	5
M	449	134	68	500	17	84	39	12	1	10	4.5
L	438	16	69	460	84	110	86	80	1	60	4.5
F	515	25	71	305	26	86	48	8	20	2.5	11
H	2000	992	75	300	34	81	51	4	3	5.7	7
N	291	229	75	405	73	92	76	23	14	3	2.5
