[gd_scene load_steps=7 format=2]

[ext_resource path="res://assets/theme/ButtonTheme.tres" type="Theme" id=1]
[ext_resource path="res://assets/background.png" type="Texture" id=2]
[ext_resource path="res://shared/back/back_button.tscn" type="PackedScene" id=3]
[ext_resource path="res://assets/theme/transparent_panel_rounded_corner.tres" type="StyleBox" id=4]
[ext_resource path="res://artiphonie/learning/phonetic_page/phonetic_page.gd" type="Script" id=5]
[ext_resource path="res://shared/instruction/instruction.tscn" type="PackedScene" id=6]

[node name="phonetic_page" type="Control"]
anchor_right = 1.0
anchor_bottom = 1.0
theme = ExtResource( 1 )
script = ExtResource( 5 )
__meta__ = {
"_edit_use_anchors_": false
}

[node name="background" type="TextureRect" parent="."]
anchor_right = 1.0
anchor_bottom = 1.0
texture = ExtResource( 2 )
expand = true

[node name="title" type="Label" parent="."]
anchor_top = 0.05
anchor_right = 1.0
anchor_bottom = 0.05
text = "Voyelle nasale"
align = 1
__meta__ = {
"_edit_use_anchors_": false
}

[node name="window" type="Panel" parent="."]
anchor_left = 0.1
anchor_top = 0.15
anchor_right = 0.9
anchor_bottom = 0.95
custom_styles/panel = ExtResource( 4 )
__meta__ = {
"_edit_use_anchors_": false
}

[node name="ScrollContainer" type="ScrollContainer" parent="window"]
anchor_left = 0.05
anchor_top = 0.05
anchor_right = 0.95
anchor_bottom = 0.95
scroll_horizontal_enabled = false
__meta__ = {
"_edit_use_anchors_": false
}

[node name="VBoxContainer" type="VBoxContainer" parent="window/ScrollContainer"]

[node name="back_button" parent="." instance=ExtResource( 3 )]

[node name="Instruction" parent="." instance=ExtResource( 6 )]
