{
    "a": "a",
    "i": "i",
    "y": "y",
    "u": "u",
    "o": "o",
    "O": "ɔ",
    "e": "e",
    "E": "ɛ",
    "°": "ə",
    "2": "ø",
    "9": "œ",
    "1": "œ̃",

    "5": "ɛ̃",
    "@": "ɑ̃",
    "§": "ɔ̃",

    "j": "j",
    "8": "ɥ",
    "w": "w",

    "p": "p",
    "b": "b",
    "t": "t",
    "d": "d",
    "k": "k",
    "g": "g",

    "f": "f",
    "v": "v",
    "s": "s",
    "z": "z",
    "S": "ʃ",
    "Z": "ʒ",

    "m": "m",
    "n": "n",
    "N": "ɲ",

    "l": "l",
    "R": "ʁ",

    "K": "ŋ"
}