{
	"playerName": "etienne",
	"stars": 12,
	"ethnicity": 1,
	"gender": 1,
	"instruction": true,
	"playerPath": "",
	"equipedItems": [

	],
	"locked_goose_easy": false,
	"locked_goose_medium": true,
	"locked_goose_hard": true,
	"locked_listen_choose_easy": false,
	"locked_listen_choose_medium": true,
	"locked_listen_choose_hard": true,
	"locked_memories_easy": false,
	"locked_memories_medium": true,
	"locked_memories_hard": true,
	"unlockedItems": [

	],
	"listOfWords": [
		{
			"listName": "Général",
			"listIconPath": "",
			"words": [
				{
					"phonetic": "ER",
					"word": "air",
					"iconPath": "res://art/word_icon/air.png"
				},
				{
					"phonetic": "ami",
					"word": "ami",
					"iconPath": "res://art/word_icon/ami.png"
				},
				{
					"phonetic": "amuR",
					"word": "amour",
					"iconPath": "res://art/word_icon/amour.png"
				},
				{
					"phonetic": "aRZ@",
					"word": "argent",
					"iconPath": "res://art/word_icon/argent.png"
				},
				{
					"phonetic": "oZuRd8i",
					"word": "aujourd'hui",
					"iconPath": "res://art/word_icon/aujourd'hui.png"
				},
				{
					"phonetic": "otR",
					"word": "autre",
					"iconPath": "res://art/word_icon/autre.png"
				},
				{
					"phonetic": "av@",
					"word": "avant",
					"iconPath": "res://art/word_icon/avant.png"
				},
				{
					"phonetic": "avwaR",
					"word": "avoir",
					"iconPath": "res://art/word_icon/avoir.png"
				},
				{
					"phonetic": "bo",
					"word": "beau",
					"iconPath": "res://art/word_icon/beau.png"
				},
				{
					"phonetic": "boku",
					"word": "beaucoup",
					"iconPath": "res://art/word_icon/beaucoup.png"
				},
				{
					"phonetic": "bj5",
					"word": "bien",
					"iconPath": "res://art/word_icon/bien.png"
				},
				{
					"phonetic": "b§",
					"word": "bon",
					"iconPath": "res://art/word_icon/bon.png"
				},
				{
					"phonetic": "b§ZuR",
					"word": "bonjour",
					"iconPath": "res://art/word_icon/bonjour.png"
				},
				{
					"phonetic": "koz",
					"word": "cause",
					"iconPath": "res://art/word_icon/cause.png"
				},
				{
					"phonetic": "S@s",
					"word": "chance",
					"iconPath": "res://art/word_icon/chance.png"
				},
				{
					"phonetic": "k§bj5",
					"word": "combien",
					"iconPath": "res://art/word_icon/combien.png"
				},
				{
					"phonetic": "kOm",
					"word": "comme",
					"iconPath": "res://art/word_icon/comme.png"
				},
				{
					"phonetic": "kom@",
					"word": "comment",
					"iconPath": "res://art/word_icon/comment.png"
				},
				{
					"phonetic": "kOR",
					"word": "corps",
					"iconPath": "res://art/word_icon/corps.png"
				},
				{
					"phonetic": "d°m5",
					"word": "demain",
					"iconPath": "res://art/word_icon/demain.png"
				},
				{
					"phonetic": "dERnjER",
					"word": "dernière",
					"iconPath": "res://art/word_icon/dernier.png"
				},
				{
					"phonetic": "dOkt9R",
					"word": "docteur",
					"iconPath": "res://art/word_icon/docteur.png"
				},
				{
					"phonetic": "o",
					"word": "eau",
					"iconPath": "res://art/word_icon/eau.png"
				},
				{
					"phonetic": "@f@",
					"word": "enfant",
					"iconPath": "res://art/word_icon/enfant.png"
				},
				{
					"phonetic": "famij",
					"word": "famille",
					"iconPath": "res://art/word_icon/famille.png"
				},
				{
					"phonetic": "fam",
					"word": "femme",
					"iconPath": "res://art/word_icon/femme.png"
				},
				{
					"phonetic": "f2",
					"word": "feu",
					"iconPath": "res://art/word_icon/feu.png"
				},
				{
					"phonetic": "fij",
					"word": "fille",
					"iconPath": "res://art/word_icon/fille.png"
				},
				{
					"phonetic": "fis",
					"word": "fils",
					"iconPath": "res://art/word_icon/fils.png"
				},
				{
					"phonetic": "f5",
					"word": "fin",
					"iconPath": "res://art/word_icon/fin.png"
				},
				{
					"phonetic": "fwa",
					"word": "fois",
					"iconPath": "res://art/word_icon/fois.png"
				},
				{
					"phonetic": "Z@",
					"word": "gens",
					"iconPath": "res://art/word_icon/gens.png"
				},
				{
					"phonetic": "gR@",
					"word": "grand",
					"iconPath": "res://art/word_icon/grand.png"
				},
				{
					"phonetic": "gER",
					"word": "guerre",
					"iconPath": "res://art/word_icon/guerre.png"
				},
				{
					"phonetic": "9R",
					"word": "heure",
					"iconPath": "res://art/word_icon/heure.png"
				},
				{
					"phonetic": "jER",
					"word": "hier",
					"iconPath": "res://art/word_icon/hier.png"
				},
				{
					"phonetic": "istwaR",
					"word": "histoire",
					"iconPath": "res://art/word_icon/histoire.png"
				},
				{
					"phonetic": "Om",
					"word": "homme",
					"iconPath": "res://art/word_icon/homme.png"
				},
				{
					"phonetic": "isi",
					"word": "ici",
					"iconPath": "res://art/word_icon/ici.png"
				},
				{
					"phonetic": "ZamE",
					"word": "jamais",
					"iconPath": "res://art/word_icon/jamais.png"
				},
				{
					"phonetic": "Z9n",
					"word": "jeune",
					"iconPath": "res://art/word_icon/jeune.png"
				},
				{
					"phonetic": "ZuR",
					"word": "jour",
					"iconPath": "res://art/word_icon/jour.png"
				},
				{
					"phonetic": "lw5",
					"word": "loin",
					"iconPath": "res://art/word_icon/loin.png"
				},
				{
					"phonetic": "la",
					"word": "là",
					"iconPath": "res://art/word_icon/la.png"
				},
				{
					"phonetic": "madam",
					"word": "madame",
					"iconPath": "res://art/word_icon/madame.png"
				},
				{
					"phonetic": "m5",
					"word": "main",
					"iconPath": "res://art/word_icon/main.png"
				},
				{
					"phonetic": "m5t°n@",
					"word": "maintenant",
					"iconPath": "res://art/word_icon/maintenant.png"
				},
				{
					"phonetic": "mEz§",
					"word": "maison",
					"iconPath": "res://art/word_icon/maison.png"
				},
				{
					"phonetic": "mal",
					"word": "mal",
					"iconPath": "res://art/word_icon/mal.png"
				},
				{
					"phonetic": "mam@",
					"word": "maman",
					"iconPath": "res://art/word_icon/maman.png"
				},
				{
					"phonetic": "maRi",
					"word": "mari",
					"iconPath": "res://art/word_icon/mari.png"
				},
				{
					"phonetic": "mat5",
					"word": "matin",
					"iconPath": "res://art/word_icon/matin.png"
				},
				{
					"phonetic": "mERsi",
					"word": "merci",
					"iconPath": "res://art/word_icon/merci.png"
				},
				{
					"phonetic": "mw5",
					"word": "moins",
					"iconPath": "res://art/word_icon/moins.png"
				},
				{
					"phonetic": "mwa",
					"word": "mois",
					"iconPath": "res://art/word_icon/mois.png"
				},
				{
					"phonetic": "mom@",
					"word": "moment",
					"iconPath": "res://art/word_icon/moment.png"
				},
				{
					"phonetic": "m§d",
					"word": "monde",
					"iconPath": "res://art/word_icon/monde.png"
				},
				{
					"phonetic": "m°sj2",
					"word": "monsieur",
					"iconPath": "res://art/word_icon/monsieur.png"
				},
				{
					"phonetic": "mOR",
					"word": "mort",
					"iconPath": "res://art/word_icon/mort.png"
				},
				{
					"phonetic": "n§",
					"word": "non",
					"iconPath": "res://art/word_icon/non.png"
				},
				{
					"phonetic": "n8i",
					"word": "nuit",
					"iconPath": "res://art/word_icon/nuit.png"
				},
				{
					"phonetic": "oke",
					"word": "ok",
					"iconPath": "res://art/word_icon/ok.png"
				},
				{
					"phonetic": "wi",
					"word": "oui",
					"iconPath": "res://art/word_icon/oui.png"
				},
				{
					"phonetic": "papa",
					"word": "papa",
					"iconPath": "res://art/word_icon/papa.png"
				},
				{
					"phonetic": "paRtiR",
					"word": "partir",
					"iconPath": "res://art/word_icon/partir.png"
				},
				{
					"phonetic": "pa",
					"word": "pas",
					"iconPath": "res://art/word_icon/pas.png"
				},
				{
					"phonetic": "pei",
					"word": "pays",
					"iconPath": "res://art/word_icon/pays.png"
				},
				{
					"phonetic": "p°ti",
					"word": "petit",
					"iconPath": "res://art/word_icon/petit.png"
				},
				{
					"phonetic": "p2",
					"word": "peu",
					"iconPath": "res://art/word_icon/peu.png"
				},
				{
					"phonetic": "p2R",
					"word": "peur",
					"iconPath": "res://art/word_icon/peur.png"
				},
				{
					"phonetic": "plas",
					"word": "place",
					"iconPath": "res://art/word_icon/place.png"
				},
				{
					"phonetic": "ply",
					"word": "plus",
					"iconPath": "res://art/word_icon/plus.png"
				},
				{
					"phonetic": "polis",
					"word": "police",
					"iconPath": "res://art/word_icon/police.png"
				},
				{
					"phonetic": "pORt",
					"word": "porte",
					"iconPath": "res://art/word_icon/porte.png"
				},
				{
					"phonetic": "puRkwa",
					"word": "pourquoi",
					"iconPath": "res://art/word_icon/pourquoi.png"
				},
				{
					"phonetic": "kEstj§",
					"word": "question",
					"iconPath": "res://art/word_icon/question.png"
				},
				{
					"phonetic": "REz§",
					"word": "raison",
					"iconPath": "res://art/word_icon/raison.png"
				},
				{
					"phonetic": "saly",
					"word": "salut",
					"iconPath": "res://art/word_icon/salut.png"
				},
				{
					"phonetic": "s@",
					"word": "sang",
					"iconPath": "res://art/word_icon/sang.png"
				},
				{
					"phonetic": "savwaR",
					"word": "savoir",
					"iconPath": "res://art/word_icon/savoir.png"
				},
				{
					"phonetic": "s9l",
					"word": "seul",
					"iconPath": "res://art/word_icon/seul.png"
				},
				{
					"phonetic": "sORtiR",
					"word": "sortir",
					"iconPath": "res://art/word_icon/sortir.png"
				},
				{
					"phonetic": "s8it",
					"word": "suite",
					"iconPath": "res://art/word_icon/suite.png"
				},
				{
					"phonetic": "syR",
					"word": "sûr",
					"iconPath": "res://art/word_icon/sur.png"
				},
				{
					"phonetic": "t@",
					"word": "tant",
					"iconPath": "res://art/word_icon/tant.png"
				},
				{
					"phonetic": "t@",
					"word": "temps",
					"iconPath": "res://art/word_icon/temps.png"
				},
				{
					"phonetic": "tER",
					"word": "terre",
					"iconPath": "res://art/word_icon/terre.png"
				},
				{
					"phonetic": "tuZuR",
					"word": "toujours",
					"iconPath": "res://art/word_icon/toujours.png"
				},
				{
					"phonetic": "tus",
					"word": "tous",
					"iconPath": "res://art/word_icon/tout.png"
				},
				{
					"phonetic": "tR5",
					"word": "train",
					"iconPath": "res://art/word_icon/train.png"
				},
				{
					"phonetic": "tRavaj",
					"word": "travail",
					"iconPath": "res://art/word_icon/travail.png"
				},
				{
					"phonetic": "v°niR",
					"word": "venir",
					"iconPath": "res://art/word_icon/venir.png"
				},
				{
					"phonetic": "vi",
					"word": "vie",
					"iconPath": "res://art/word_icon/vie.png"
				},
				{
					"phonetic": "vil",
					"word": "ville",
					"iconPath": "res://art/word_icon/ville.png"
				},
				{
					"phonetic": "vwatyR",
					"word": "voiture",
					"iconPath": "res://art/word_icon/voiture.png"
				},
				{
					"phonetic": "vRE",
					"word": "vrai",
					"iconPath": "res://art/word_icon/vrai.png"
				},
				{
					"phonetic": "j2",
					"word": "yeux",
					"iconPath": "res://art/word_icon/oeil.png"
				}
			]
		},
		{
			"listName": "Monosyllabique",
			"listIconPath": "res://art/word_icon/un.png",
			"words": [
				{
					"phonetic": "Ed",
					"word": "aide",
					"iconPath": "res://art/word_icon/aide.png"
				},
				{
					"phonetic": "ER",
					"word": "air",
					"iconPath": "res://art/word_icon/air.png"
				},
				{
					"phonetic": "aRm",
					"word": "arme",
					"iconPath": "res://art/word_icon/arme.png"
				},
				{
					"phonetic": "otR",
					"word": "autre",
					"iconPath": "res://art/word_icon/autre.png"
				},
				{
					"phonetic": "bo",
					"word": "beau",
					"iconPath": "res://art/word_icon/beau.png"
				},
				{
					"phonetic": "bj5",
					"word": "bien",
					"iconPath": "res://art/word_icon/bien.png"
				},
				{
					"phonetic": "bwa",
					"word": "bois",
					"iconPath": "res://art/word_icon/bois.png"
				},
				{
					"phonetic": "b§",
					"word": "bon",
					"iconPath": "res://art/word_icon/bon.png"
				},
				{
					"phonetic": "bu",
					"word": "bout",
					"iconPath": "res://art/word_icon/bout.png"
				},
				{
					"phonetic": "bRa",
					"word": "bras",
					"iconPath": "res://art/word_icon/bras.png"
				},
				{
					"phonetic": "koz",
					"word": "cause",
					"iconPath": "res://art/word_icon/cause.png"
				},
				{
					"phonetic": "S@s",
					"word": "chance",
					"iconPath": "res://art/word_icon/chance.png"
				},
				{
					"phonetic": "SER",
					"word": "cher",
					"iconPath": "res://art/word_icon/cher.png"
				},
				{
					"phonetic": "Sj5",
					"word": "chien",
					"iconPath": "res://art/word_icon/chien.png"
				},
				{
					"phonetic": "sjEl",
					"word": "ciel",
					"iconPath": "res://art/word_icon/ciel.png"
				},
				{
					"phonetic": "kOm",
					"word": "comme",
					"iconPath": "res://art/word_icon/comme.png"
				},
				{
					"phonetic": "k§t",
					"word": "compte",
					"iconPath": "res://art/word_icon/compte.png"
				},
				{
					"phonetic": "kOR",
					"word": "corps",
					"iconPath": "res://art/word_icon/corps.png"
				},
				{
					"phonetic": "kuR",
					"word": "cours",
					"iconPath": "res://art/word_icon/cours.png"
				},
				{
					"phonetic": "do",
					"word": "dos",
					"iconPath": "res://art/word_icon/dos.png"
				},
				{
					"phonetic": "dyR",
					"word": "dur",
					"iconPath": "res://art/word_icon/dur.png"
				},
				{
					"phonetic": "o",
					"word": "eau",
					"iconPath": "res://art/word_icon/eau.png"
				},
				{
					"phonetic": "@",
					"word": "en",
					"iconPath": "res://art/word_icon/en.png"
				},
				{
					"phonetic": "f5",
					"word": "faim",
					"iconPath": "res://art/word_icon/faim.png"
				},
				{
					"phonetic": "fam",
					"word": "femme",
					"iconPath": "res://art/word_icon/femme.png"
				},
				{
					"phonetic": "f2",
					"word": "feu",
					"iconPath": "res://art/word_icon/feu.png"
				},
				{
					"phonetic": "fij",
					"word": "fille",
					"iconPath": "res://art/word_icon/fille.png"
				},
				{
					"phonetic": "film",
					"word": "film",
					"iconPath": "res://art/word_icon/film.png"
				},
				{
					"phonetic": "fis",
					"word": "fils",
					"iconPath": "res://art/word_icon/fils.png"
				},
				{
					"phonetic": "f5",
					"word": "fin",
					"iconPath": "res://art/word_icon/fin.png"
				},
				{
					"phonetic": "fwa",
					"word": "fois",
					"iconPath": "res://art/word_icon/fois.png"
				},
				{
					"phonetic": "f§",
					"word": "fond",
					"iconPath": "res://art/word_icon/fond.png"
				},
				{
					"phonetic": "fORs",
					"word": "force",
					"iconPath": "res://art/word_icon/force.png"
				},
				{
					"phonetic": "fOR",
					"word": "fort",
					"iconPath": "res://art/word_icon/fort.png"
				},
				{
					"phonetic": "fu",
					"word": "fou",
					"iconPath": "res://art/word_icon/fou.png"
				},
				{
					"phonetic": "Z@",
					"word": "gens",
					"iconPath": "res://art/word_icon/gens.png"
				},
				{
					"phonetic": "gR@",
					"word": "grand",
					"iconPath": "res://art/word_icon/grand.png"
				},
				{
					"phonetic": "gRo",
					"word": "gros",
					"iconPath": "res://art/word_icon/gros.png"
				},
				{
					"phonetic": "gER",
					"word": "guerre",
					"iconPath": "res://art/word_icon/guerre.png"
				},
				{
					"phonetic": "9R",
					"word": "heure",
					"iconPath": "res://art/word_icon/heure.png"
				},
				{
					"phonetic": "jER",
					"word": "hier",
					"iconPath": "res://art/word_icon/hier.png"
				},
				{
					"phonetic": "Om",
					"word": "homme",
					"iconPath": "res://art/word_icon/homme.png"
				},
				{
					"phonetic": "§t",
					"word": "honte",
					"iconPath": "res://art/word_icon/honte.png"
				},
				{
					"phonetic": "Z2",
					"word": "jeu",
					"iconPath": "res://art/word_icon/jeu.png"
				},
				{
					"phonetic": "Z9n",
					"word": "jeune",
					"iconPath": "res://art/word_icon/jeune.png"
				},
				{
					"phonetic": "ZuR",
					"word": "jour",
					"iconPath": "res://art/word_icon/jour.png"
				},
				{
					"phonetic": "lEtR",
					"word": "lettre",
					"iconPath": "res://art/word_icon/lettre.png"
				},
				{
					"phonetic": "libR",
					"word": "libre",
					"iconPath": "res://art/word_icon/libre.png"
				},
				{
					"phonetic": "li",
					"word": "lit",
					"iconPath": "res://art/word_icon/lit.png"
				},
				{
					"phonetic": "livR",
					"word": "livre",
					"iconPath": "res://art/word_icon/livre.png"
				},
				{
					"phonetic": "lw5",
					"word": "loin",
					"iconPath": "res://art/word_icon/loin.png"
				},
				{
					"phonetic": "la",
					"word": "là",
					"iconPath": "res://art/word_icon/la.png"
				},
				{
					"phonetic": "m5",
					"word": "main",
					"iconPath": "res://art/word_icon/main.png"
				},
				{
					"phonetic": "mal",
					"word": "mal",
					"iconPath": "res://art/word_icon/mal.png"
				},
				{
					"phonetic": "mw5",
					"word": "moins",
					"iconPath": "res://art/word_icon/moins.png"
				},
				{
					"phonetic": "mwa",
					"word": "mois",
					"iconPath": "res://art/word_icon/mois.png"
				},
				{
					"phonetic": "m§d",
					"word": "monde",
					"iconPath": "res://art/word_icon/monde.png"
				},
				{
					"phonetic": "mOR",
					"word": "mort",
					"iconPath": "res://art/word_icon/mort.png"
				},
				{
					"phonetic": "mo",
					"word": "mot",
					"iconPath": "res://art/word_icon/mot.png"
				},
				{
					"phonetic": "n§",
					"word": "non",
					"iconPath": "res://art/word_icon/non.png"
				},
				{
					"phonetic": "n8i",
					"word": "nuit",
					"iconPath": "res://art/word_icon/nuit.png"
				},
				{
					"phonetic": "§kl",
					"word": "oncle",
					"iconPath": "res://art/word_icon/oncle.png"
				},
				{
					"phonetic": "OR",
					"word": "or",
					"iconPath": "res://art/word_icon/or.png"
				},
				{
					"phonetic": "wi",
					"word": "oui",
					"iconPath": "res://art/word_icon/oui.png"
				},
				{
					"phonetic": "pE",
					"word": "paix",
					"iconPath": "res://art/word_icon/paix.png"
				},
				{
					"phonetic": "pa",
					"word": "pas",
					"iconPath": "res://art/word_icon/pas.png"
				},
				{
					"phonetic": "povR",
					"word": "pauvre",
					"iconPath": "res://art/word_icon/pauvre.png"
				},
				{
					"phonetic": "pERdR",
					"word": "perdre",
					"iconPath": "res://art/word_icon/perdre.png"
				},
				{
					"phonetic": "p2",
					"word": "peu",
					"iconPath": "res://art/word_icon/peu.png"
				},
				{
					"phonetic": "p2R",
					"word": "peur",
					"iconPath": "res://art/word_icon/peur.png"
				},
				{
					"phonetic": "plas",
					"word": "place",
					"iconPath": "res://art/word_icon/place.png"
				},
				{
					"phonetic": "pl@",
					"word": "plan",
					"iconPath": "res://art/word_icon/plan.png"
				},
				{
					"phonetic": "pl5",
					"word": "plein",
					"iconPath": "res://art/word_icon/plein.png"
				},
				{
					"phonetic": "ply",
					"word": "plus",
					"iconPath": "res://art/word_icon/plus.png"
				},
				{
					"phonetic": "pw5",
					"word": "point",
					"iconPath": "res://art/word_icon/point.png"
				},
				{
					"phonetic": "pORt",
					"word": "porte",
					"iconPath": "res://art/word_icon/porte.png"
				},
				{
					"phonetic": "pRi",
					"word": "prix",
					"iconPath": "res://art/word_icon/prix.png"
				},
				{
					"phonetic": "pROpR",
					"word": "propre",
					"iconPath": "res://art/word_icon/propre.png"
				},
				{
					"phonetic": "Rwa",
					"word": "roi",
					"iconPath": "res://art/word_icon/roi.png"
				},
				{
					"phonetic": "Rut",
					"word": "route",
					"iconPath": "res://art/word_icon/route.png"
				},
				{
					"phonetic": "Ry",
					"word": "rue",
					"iconPath": "res://art/word_icon/rue.png"
				},
				{
					"phonetic": "sak",
					"word": "sac",
					"iconPath": "res://art/word_icon/sac.png"
				},
				{
					"phonetic": "sal",
					"word": "sale",
					"iconPath": "res://art/word_icon/sale.png"
				},
				{
					"phonetic": "s@",
					"word": "sang",
					"iconPath": "res://art/word_icon/sang.png"
				},
				{
					"phonetic": "s@s",
					"word": "sens",
					"iconPath": "res://art/word_icon/sens.png"
				},
				{
					"phonetic": "s9l",
					"word": "seul",
					"iconPath": "res://art/word_icon/seul.png"
				},
				{
					"phonetic": "s5pl",
					"word": "simple",
					"iconPath": "res://art/word_icon/simple.png"
				},
				{
					"phonetic": "s8it",
					"word": "suite",
					"iconPath": "res://art/word_icon/suite.png"
				},
				{
					"phonetic": "syR",
					"word": "sûr",
					"iconPath": "res://art/word_icon/sur.png"
				},
				{
					"phonetic": "tabl",
					"word": "table",
					"iconPath": "res://art/word_icon/table.png"
				},
				{
					"phonetic": "t@",
					"word": "tant",
					"iconPath": "res://art/word_icon/tant.png"
				},
				{
					"phonetic": "t@",
					"word": "temps",
					"iconPath": "res://art/word_icon/temps.png"
				},
				{
					"phonetic": "tER",
					"word": "terre",
					"iconPath": "res://art/word_icon/terre.png"
				},
				{
					"phonetic": "tuR",
					"word": "tour",
					"iconPath": "res://art/word_icon/tour.png"
				},
				{
					"phonetic": "tus",
					"word": "tous",
					"iconPath": "res://art/word_icon/tout.png"
				},
				{
					"phonetic": "tR5",
					"word": "train",
					"iconPath": "res://art/word_icon/train.png"
				},
				{
					"phonetic": "vER",
					"word": "verre",
					"iconPath": "res://art/word_icon/verre.png"
				},
				{
					"phonetic": "vi",
					"word": "vie",
					"iconPath": "res://art/word_icon/vie.png"
				},
				{
					"phonetic": "vj2",
					"word": "vieux",
					"iconPath": "res://art/word_icon/vieux.png"
				},
				{
					"phonetic": "vil",
					"word": "ville",
					"iconPath": "res://art/word_icon/ville.png"
				},
				{
					"phonetic": "vRE",
					"word": "vrai",
					"iconPath": "res://art/word_icon/vrai.png"
				},
				{
					"phonetic": "j2",
					"word": "yeux",
					"iconPath": "res://art/word_icon/oeil.png"
				}
			]
		},
		{
			"listName": "Bisyllabique",
			"listIconPath": "res://art/word_icon/deux.png",
			"words": [
				{
					"phonetic": "ami",
					"word": "ami",
					"iconPath": "res://art/word_icon/ami.png"
				},
				{
					"phonetic": "ami",
					"word": "amie",
					"iconPath": "res://art/word_icon/amie.png"
				},
				{
					"phonetic": "amuR",
					"word": "amour",
					"iconPath": "res://art/word_icon/amour.png"
				},
				{
					"phonetic": "aRZ@",
					"word": "argent",
					"iconPath": "res://art/word_icon/argent.png"
				},
				{
					"phonetic": "av@",
					"word": "avant",
					"iconPath": "res://art/word_icon/avant.png"
				},
				{
					"phonetic": "avj§",
					"word": "avion",
					"iconPath": "res://art/word_icon/avion.png"
				},
				{
					"phonetic": "avwaR",
					"word": "avoir",
					"iconPath": "res://art/word_icon/avoir.png"
				},
				{
					"phonetic": "bato",
					"word": "bateau",
					"iconPath": "res://art/word_icon/bateau.png"
				},
				{
					"phonetic": "boku",
					"word": "beaucoup",
					"iconPath": "res://art/word_icon/beaucoup.png"
				},
				{
					"phonetic": "bizaR",
					"word": "bizarre",
					"iconPath": "res://art/word_icon/bizarre.png"
				},
				{
					"phonetic": "b§ZuR",
					"word": "bonjour",
					"iconPath": "res://art/word_icon/bonjour.png"
				},
				{
					"phonetic": "byRo",
					"word": "bureau",
					"iconPath": "res://art/word_icon/bureau.png"
				},
				{
					"phonetic": "S°m5",
					"word": "chemin",
					"iconPath": "res://art/word_icon/chemin.png"
				},
				{
					"phonetic": "S°v2",
					"word": "cheveux",
					"iconPath": "res://art/word_icon/cheveu.png"
				},
				{
					"phonetic": "k§bj5",
					"word": "combien",
					"iconPath": "res://art/word_icon/combien.png"
				},
				{
					"phonetic": "kom@",
					"word": "comment",
					"iconPath": "res://art/word_icon/comment.png"
				},
				{
					"phonetic": "k§t@",
					"word": "content",
					"iconPath": "res://art/word_icon/content.png"
				},
				{
					"phonetic": "d2OR",
					"word": "dehors",
					"iconPath": "res://art/word_icon/dehors.png"
				},
				{
					"phonetic": "d°m5",
					"word": "demain",
					"iconPath": "res://art/word_icon/demain.png"
				},
				{
					"phonetic": "d°p8i",
					"word": "depuis",
					"iconPath": "res://art/word_icon/depuis.png"
				},
				{
					"phonetic": "dERnje",
					"word": "dernier",
					"iconPath": "res://art/word_icon/dernier.png"
				},
				{
					"phonetic": "d°sy",
					"word": "dessus",
					"iconPath": "res://art/word_icon/dessus.png"
				},
				{
					"phonetic": "dOkt9R",
					"word": "docteur",
					"iconPath": "res://art/word_icon/docteur.png"
				},
				{
					"phonetic": "dolaR",
					"word": "dollars",
					"iconPath": "res://art/word_icon/dollar.png"
				},
				{
					"phonetic": "dORmiR",
					"word": "dormir",
					"iconPath": "res://art/word_icon/dormir.png"
				},
				{
					"phonetic": "@dRwa",
					"word": "endroit",
					"iconPath": "res://art/word_icon/endroit.png"
				},
				{
					"phonetic": "@f@",
					"word": "enfant",
					"iconPath": "res://art/word_icon/enfant.png"
				},
				{
					"phonetic": "@s8it",
					"word": "ensuite",
					"iconPath": "res://art/word_icon/ensuite.png"
				},
				{
					"phonetic": "fasil",
					"word": "facile",
					"iconPath": "res://art/word_icon/facile.png"
				},
				{
					"phonetic": "famij",
					"word": "famille",
					"iconPath": "res://art/word_icon/famille.png"
				},
				{
					"phonetic": "2R2",
					"word": "heureux",
					"iconPath": "res://art/word_icon/heureux.png"
				},
				{
					"phonetic": "istwaR",
					"word": "histoire",
					"iconPath": "res://art/word_icon/histoire.png"
				},
				{
					"phonetic": "on9R",
					"word": "honneur",
					"iconPath": "res://art/word_icon/honneur.png"
				},
				{
					"phonetic": "isi",
					"word": "ici",
					"iconPath": "res://art/word_icon/ici.png"
				},
				{
					"phonetic": "5st@",
					"word": "instant",
					"iconPath": "res://art/word_icon/instant.png"
				},
				{
					"phonetic": "ZamE",
					"word": "jamais",
					"iconPath": "res://art/word_icon/jamais.png"
				},
				{
					"phonetic": "Zoli",
					"word": "jolie",
					"iconPath": "res://art/word_icon/joli.png"
				},
				{
					"phonetic": "madam",
					"word": "madame",
					"iconPath": "res://art/word_icon/madame.png"
				},
				{
					"phonetic": "mEz§",
					"word": "maison",
					"iconPath": "res://art/word_icon/maison.png"
				},
				{
					"phonetic": "malad",
					"word": "malade",
					"iconPath": "res://art/word_icon/malade.png"
				},
				{
					"phonetic": "mam@",
					"word": "maman",
					"iconPath": "res://art/word_icon/maman.png"
				},
				{
					"phonetic": "maRi",
					"word": "mari",
					"iconPath": "res://art/word_icon/mari.png"
				},
				{
					"phonetic": "maRjaZ",
					"word": "mariage",
					"iconPath": "res://art/word_icon/mariage.png"
				},
				{
					"phonetic": "mat5",
					"word": "matin",
					"iconPath": "res://art/word_icon/matin.png"
				},
				{
					"phonetic": "movE",
					"word": "mauvais",
					"iconPath": "res://art/word_icon/mauvais.png"
				},
				{
					"phonetic": "mERsi",
					"word": "merci",
					"iconPath": "res://art/word_icon/merci.png"
				},
				{
					"phonetic": "mesj2",
					"word": "messieurs",
					"iconPath": "res://art/word_icon/monsieur.png"
				},
				{
					"phonetic": "minyt",
					"word": "minute",
					"iconPath": "res://art/word_icon/minute.png"
				},
				{
					"phonetic": "mom@",
					"word": "moment",
					"iconPath": "res://art/word_icon/moment.png"
				},
				{
					"phonetic": "myzik",
					"word": "musique",
					"iconPath": "res://art/word_icon/musique.png"
				},
				{
					"phonetic": "nuvo",
					"word": "nouveau",
					"iconPath": "res://art/word_icon/nouveau.png"
				},
				{
					"phonetic": "nuvEl",
					"word": "nouvelle",
					"iconPath": "res://art/word_icon/nouvelle.png"
				},
				{
					"phonetic": "oke",
					"word": "ok",
					"iconPath": "res://art/word_icon/ok.png"
				},
				{
					"phonetic": "papa",
					"word": "papa",
					"iconPath": "res://art/word_icon/papa.png"
				},
				{
					"phonetic": "paRfwa",
					"word": "parfois",
					"iconPath": "res://art/word_icon/parfois.png"
				},
				{
					"phonetic": "paRti",
					"word": "partie",
					"iconPath": "res://art/word_icon/partie.png"
				},
				{
					"phonetic": "paRtiR",
					"word": "partir",
					"iconPath": "res://art/word_icon/partir.png"
				},
				{
					"phonetic": "pei",
					"word": "pays",
					"iconPath": "res://art/word_icon/pays.png"
				},
				{
					"phonetic": "pERsOn",
					"word": "personne",
					"iconPath": "res://art/word_icon/personne.png"
				},
				{
					"phonetic": "p°ti",
					"word": "petit",
					"iconPath": "res://art/word_icon/petit.png"
				},
				{
					"phonetic": "foto",
					"word": "photo",
					"iconPath": "res://art/word_icon/photo.png"
				},
				{
					"phonetic": "polis",
					"word": "police",
					"iconPath": "res://art/word_icon/police.png"
				},
				{
					"phonetic": "puRkwa",
					"word": "pourquoi",
					"iconPath": "res://art/word_icon/pourquoi.png"
				},
				{
					"phonetic": "puvwaR",
					"word": "pouvoir",
					"iconPath": "res://art/word_icon/pouvoir.png"
				},
				{
					"phonetic": "pR2mje",
					"word": "premier",
					"iconPath": "res://art/word_icon/premier.png"
				},
				{
					"phonetic": "pRiz§",
					"word": "prison",
					"iconPath": "res://art/word_icon/prison.png"
				},
				{
					"phonetic": "kEstj§",
					"word": "question",
					"iconPath": "res://art/word_icon/question.png"
				},
				{
					"phonetic": "REz§",
					"word": "raison",
					"iconPath": "res://art/word_icon/raison.png"
				},
				{
					"phonetic": "R@tRe",
					"word": "rentrer",
					"iconPath": "res://art/word_icon/rentrer.png"
				},
				{
					"phonetic": "saly",
					"word": "salut",
					"iconPath": "res://art/word_icon/salut.png"
				},
				{
					"phonetic": "savwaR",
					"word": "savoir",
					"iconPath": "res://art/word_icon/savoir.png"
				},
				{
					"phonetic": "s°mEn",
					"word": "semaine",
					"iconPath": "res://art/word_icon/semaine.png"
				},
				{
					"phonetic": "sERvis",
					"word": "service",
					"iconPath": "res://art/word_icon/service.png"
				},
				{
					"phonetic": "sil@s",
					"word": "silence",
					"iconPath": "res://art/word_icon/silence.png"
				},
				{
					"phonetic": "solEj",
					"word": "soleil",
					"iconPath": "res://art/word_icon/soleil.png"
				},
				{
					"phonetic": "sORtiR",
					"word": "sortir",
					"iconPath": "res://art/word_icon/sortir.png"
				},
				{
					"phonetic": "suv@",
					"word": "souvent",
					"iconPath": "res://art/word_icon/souvent.png"
				},
				{
					"phonetic": "sypER",
					"word": "super",
					"iconPath": "res://art/word_icon/super.png"
				},
				{
					"phonetic": "t§be",
					"word": "tomber",
					"iconPath": "res://art/word_icon/tomber.png"
				},
				{
					"phonetic": "tuZuR",
					"word": "toujours",
					"iconPath": "res://art/word_icon/toujours.png"
				},
				{
					"phonetic": "tRavaj",
					"word": "travail",
					"iconPath": "res://art/word_icon/travail.png"
				},
				{
					"phonetic": "v°niR",
					"word": "venir",
					"iconPath": "res://art/word_icon/venir.png"
				},
				{
					"phonetic": "vizaZ",
					"word": "visage",
					"iconPath": "res://art/word_icon/visage.png"
				},
				{
					"phonetic": "vwatyR",
					"word": "voiture",
					"iconPath": "res://art/word_icon/voiture.png"
				},
				{
					"phonetic": "vwajaZ",
					"word": "voyage",
					"iconPath": "res://art/word_icon/voyage.png"
				}
			]
		},
		{
			"listName": "Trisyllabique",
			"listIconPath": "res://art/word_icon/trois.png",
			"words": [
				{
					"phonetic": "aksEpte",
					"word": "accepter",
					"iconPath": "res://art/word_icon/accepter.png"
				},
				{
					"phonetic": "aksid@",
					"word": "accident",
					"iconPath": "res://art/word_icon/accident.png"
				},
				{
					"phonetic": "@byl@s",
					"word": "ambulance",
					"iconPath": "res://art/word_icon/ambulance.png"
				},
				{
					"phonetic": "amuR2z",
					"word": "amoureuse",
					"iconPath": "res://art/word_icon/amoureux.png"
				},
				{
					"phonetic": "amyz@",
					"word": "amusant",
					"iconPath": "res://art/word_icon/amusant.png"
				},
				{
					"phonetic": "animal",
					"word": "animal",
					"iconPath": "res://art/word_icon/animal.png"
				},
				{
					"phonetic": "apaREj",
					"word": "appareil",
					"iconPath": "res://art/word_icon/appareil.png"
				},
				{
					"phonetic": "as@s9R",
					"word": "ascenseur",
					"iconPath": "res://art/word_icon/ascenseur.png"
				},
				{
					"phonetic": "asyR@s",
					"word": "assurance",
					"iconPath": "res://art/word_icon/assurance.png"
				},
				{
					"phonetic": "at@sj§",
					"word": "attention",
					"iconPath": "res://art/word_icon/attention.png"
				},
				{
					"phonetic": "atRape",
					"word": "attraper",
					"iconPath": "res://art/word_icon/attraper.png"
				},
				{
					"phonetic": "oZuRd8i",
					"word": "aujourd'hui",
					"iconPath": "res://art/word_icon/aujourd'hui.png"
				},
				{
					"phonetic": "av@se",
					"word": "avancer",
					"iconPath": "res://art/word_icon/avancer.png"
				},
				{
					"phonetic": "av@tyR",
					"word": "aventure",
					"iconPath": "res://art/word_icon/aventure.png"
				},
				{
					"phonetic": "avoka",
					"word": "avocat",
					"iconPath": "res://art/word_icon/avocat.png"
				},
				{
					"phonetic": "kapitEn",
					"word": "capitaine",
					"iconPath": "res://art/word_icon/capitaine.png"
				},
				{
					"phonetic": "koS°maR",
					"word": "cauchemar",
					"iconPath": "res://art/word_icon/cauchemar.png"
				},
				{
					"phonetic": "S@Z°m@",
					"word": "changement",
					"iconPath": "res://art/word_icon/changement.png"
				},
				{
					"phonetic": "Sokola",
					"word": "chocolat",
					"iconPath": "res://art/word_icon/chocolat.png"
				},
				{
					"phonetic": "sigaREt",
					"word": "cigarette",
					"iconPath": "res://art/word_icon/cigarette.png"
				},
				{
					"phonetic": "kom@se",
					"word": "commencer",
					"iconPath": "res://art/word_icon/commencer.png"
				},
				{
					"phonetic": "k§tin8e",
					"word": "continuer",
					"iconPath": "res://art/word_icon/continuer.png"
				},
				{
					"phonetic": "kuvERtyR",
					"word": "couverture",
					"iconPath": "res://art/word_icon/couverture.png"
				},
				{
					"phonetic": "difisil",
					"word": "difficile",
					"iconPath": "res://art/word_icon/difficile.png"
				},
				{
					"phonetic": "diREkt9R",
					"word": "directeur",
					"iconPath": "res://art/word_icon/directeur.png"
				},
				{
					"phonetic": "diREksj§",
					"word": "direction",
					"iconPath": "res://art/word_icon/direction.png"
				},
				{
					"phonetic": "diskyte",
					"word": "discuter",
					"iconPath": "res://art/word_icon/discuter.png"
				},
				{
					"phonetic": "dispaREtR",
					"word": "disparaître",
					"iconPath": "res://art/word_icon/disparaitre.png"
				},
				{
					"phonetic": "dus°m@",
					"word": "doucement",
					"iconPath": "res://art/word_icon/doucement.png"
				},
				{
					"phonetic": "@p°R9R",
					"word": "empereur",
					"iconPath": "res://art/word_icon/empereur.png"
				},
				{
					"phonetic": "@tR°pRiz",
					"word": "entreprise",
					"iconPath": "res://art/word_icon/entreprise.png"
				},
				{
					"phonetic": "@viR§",
					"word": "environ",
					"iconPath": "res://art/word_icon/environ.png"
				},
				{
					"phonetic": "Eskalje",
					"word": "escalier",
					"iconPath": "res://art/word_icon/escalier.png"
				},
				{
					"phonetic": "Estoma",
					"word": "estomac",
					"iconPath": "res://art/word_icon/estomac.png"
				},
				{
					"phonetic": "Eksplozj§",
					"word": "explosion",
					"iconPath": "res://art/word_icon/explosion.png"
				},
				{
					"phonetic": "f@tastik",
					"word": "fantastique",
					"iconPath": "res://art/word_icon/fantastique.png"
				},
				{
					"phonetic": "5pORt@",
					"word": "important",
					"iconPath": "res://art/word_icon/important.png"
				},
				{
					"phonetic": "inos@",
					"word": "innocent",
					"iconPath": "res://art/word_icon/innocent.png"
				},
				{
					"phonetic": "5spEkt9R",
					"word": "inspecteur",
					"iconPath": "res://art/word_icon/inspecteur.png"
				},
				{
					"phonetic": "ZuRnalist",
					"word": "journaliste",
					"iconPath": "res://art/word_icon/journaliste.png"
				},
				{
					"phonetic": "magaz5",
					"word": "magasin",
					"iconPath": "res://art/word_icon/magasin.png"
				},
				{
					"phonetic": "m5t°n@",
					"word": "maintenant",
					"iconPath": "res://art/word_icon/maintenant.png"
				},
				{
					"phonetic": "maladi",
					"word": "maladie",
					"iconPath": "res://art/word_icon/maladie.png"
				},
				{
					"phonetic": "militER",
					"word": "militaire",
					"iconPath": "res://art/word_icon/militaire.png"
				},
				{
					"phonetic": "muv°m@",
					"word": "mouvement",
					"iconPath": "res://art/word_icon/mouvement.png"
				},
				{
					"phonetic": "nuRityR",
					"word": "nourriture",
					"iconPath": "res://art/word_icon/nourriture.png"
				},
				{
					"phonetic": "Opt°niR",
					"word": "obtenir",
					"iconPath": "res://art/word_icon/obtenir.png"
				},
				{
					"phonetic": "oRiZin",
					"word": "origine",
					"iconPath": "res://art/word_icon/origine.png"
				},
				{
					"phonetic": "p@tal§",
					"word": "pantalon",
					"iconPath": "res://art/word_icon/pantalon.png"
				},
				{
					"phonetic": "paRtaZe",
					"word": "partager",
					"iconPath": "res://art/word_icon/partager.png"
				},
				{
					"phonetic": "pERsonEl",
					"word": "personnel",
					"iconPath": "res://art/word_icon/personnel.png"
				},
				{
					"phonetic": "pistolE",
					"word": "pistolet",
					"iconPath": "res://art/word_icon/pistolet.png"
				},
				{
					"phonetic": "politik",
					"word": "politique",
					"iconPath": "res://art/word_icon/politique.png"
				},
				{
					"phonetic": "pozisj§",
					"word": "position",
					"iconPath": "res://art/word_icon/position.png"
				},
				{
					"phonetic": "pRofEs9R",
					"word": "professeur",
					"iconPath": "res://art/word_icon/professeur.png"
				},
				{
					"phonetic": "pRotEksj§",
					"word": "protection",
					"iconPath": "res://art/word_icon/protection.png"
				},
				{
					"phonetic": "R°s°vwaR",
					"word": "recevoir",
					"iconPath": "res://art/word_icon/recevoir.png"
				},
				{
					"phonetic": "R°liZj§",
					"word": "religion",
					"iconPath": "res://art/word_icon/religion.png"
				},
				{
					"phonetic": "R@devu",
					"word": "rendez-vous",
					"iconPath": "res://art/word_icon/rendez-vous.png"
				},
				{
					"phonetic": "REspiRe",
					"word": "respirer",
					"iconPath": "res://art/word_icon/respirer.png"
				},
				{
					"phonetic": "REsp§sabl",
					"word": "responsable",
					"iconPath": "res://art/word_icon/responsable.png"
				},
				{
					"phonetic": "REstoR@",
					"word": "restaurant",
					"iconPath": "res://art/word_icon/restaurant.png"
				},
				{
					"phonetic": "R°v°niR",
					"word": "revenir",
					"iconPath": "res://art/word_icon/revenir.png"
				},
				{
					"phonetic": "Rom@tik",
					"word": "romantique",
					"iconPath": "res://art/word_icon/romantique.png"
				},
				{
					"phonetic": "s@tim@",
					"word": "sentiment",
					"iconPath": "res://art/word_icon/sentiment.png"
				},
				{
					"phonetic": "sypoRte",
					"word": "supporter",
					"iconPath": "res://art/word_icon/supporter.png"
				},
				{
					"phonetic": "tREt°m@",
					"word": "traitement",
					"iconPath": "res://art/word_icon/traitement.png"
				},
				{
					"phonetic": "tRavERse",
					"word": "traverser",
					"iconPath": "res://art/word_icon/traverser.png"
				},
				{
					"phonetic": "tRibynal",
					"word": "tribunal",
					"iconPath": "res://art/word_icon/tribunal.png"
				},
				{
					"phonetic": "ynivER",
					"word": "univers",
					"iconPath": "res://art/word_icon/univers.png"
				},
				{
					"phonetic": "vizite",
					"word": "visiter",
					"iconPath": "res://art/word_icon/visiter.png"
				}
			]
		}
	]
}