[gd_scene load_steps=3 format=2]

[ext_resource path="res://assets/theme/ButtonTheme.tres" type="Theme" id=1]
[ext_resource path="res://shared/avatarspace/item_type.gd" type="Script" id=2]

[node name="Control" type="Control"]
anchor_right = 1.0
anchor_bottom = 1.0
margin_bottom = 6.10352e-05
rect_min_size = Vector2( 100, 100 )
script = ExtResource( 2 )
__meta__ = {
"_edit_use_anchors_": false
}

[node name="Button" type="Button" parent="."]
anchor_right = 1.0
anchor_bottom = 1.0
margin_left = 1.68188
margin_top = 1.68182
margin_right = 1.68188
margin_bottom = 1.68182
theme = ExtResource( 1 )

[node name="itemTypePicture" type="TextureRect" parent="Button"]
anchor_right = 1.0
anchor_bottom = 1.0
margin_top = -0.139648
margin_bottom = 0.300293
expand = true
__meta__ = {
"_edit_use_anchors_": false
}

[connection signal="pressed" from="Button" to="." method="_on_Button_pressed"]
