{
    "sound" : "home.ogg",
    "text": "Coucou, bienvenue dans mon monde. Je m’appelle Mozart et je vais t’accompagner dans toutes tes activités. Ensemble, tu vas voir on va bien s’amuser : tu vas pouvoir apprendre, t’entraîner, jouer et devenir trop fort dans la prononciation des mots courants. Tu verras, tu vas faire de fabuleux progrès ! Allez, on y va."
}