[gd_resource type="Theme" load_steps=7 format=2]

[ext_resource path="res://gui/font_14.tres" type="DynamicFont" id=1]

[sub_resource type="DynamicFont" id=1]

size = 16
use_mipmaps = false
use_filter = false
font_data = ExtResource( 2 )
fallback/0 = ExtResource( 1 )

[sub_resource type="StyleBoxTexture" id=2]

content_margin_left = -1.0
content_margin_right = -1.0
content_margin_top = -1.0
content_margin_bottom = -1.0
texture = ExtResource( 3 )
margin_left = 0.0
margin_right = 0.0
margin_top = 0.0
margin_bottom = 0.0
expand_margin_left = 0.0
expand_margin_right = 0.0
expand_margin_top = 0.0
expand_margin_bottom = 0.0
draw_center = true

[sub_resource type="StyleBoxTexture" id=3]

content_margin_left = -1.0
content_margin_right = -1.0
content_margin_top = -1.0
content_margin_bottom = -1.0
texture = ExtResource( 4 )
margin_left = 0.0
margin_right = 0.0
margin_top = 0.0
margin_bottom = 0.0
expand_margin_left = 0.0
expand_margin_right = 0.0
expand_margin_top = 0.0
expand_margin_bottom = 0.0
draw_center = true

[sub_resource type="StyleBoxTexture" id=4]

content_margin_left = -1.0
content_margin_right = -1.0
content_margin_top = -1.0
content_margin_bottom = -1.0
texture = ExtResource( 5 )
margin_left = 0.0
margin_right = 0.0
margin_top = 0.0
margin_bottom = 0.0
expand_margin_left = 0.0
expand_margin_right = 0.0
expand_margin_top = 0.0
expand_margin_bottom = 0.0
draw_center = true

[sub_resource type="StyleBoxTexture" id=5]

content_margin_left = -1.0
content_margin_right = -1.0
content_margin_top = -1.0
content_margin_bottom = -1.0
texture = ExtResource( 6 )
margin_left = 0.0
margin_right = 0.0
margin_top = 0.0
margin_bottom = 0.0
expand_margin_left = 0.0
expand_margin_right = 0.0
expand_margin_top = 0.0
expand_margin_bottom = 0.0
draw_center = true

[sub_resource type="StyleBoxTexture" id=6]

content_margin_left = -1.0
content_margin_right = -1.0
content_margin_top = -1.0
content_margin_bottom = -1.0
texture = ExtResource( 7 )
margin_left = 0.0
margin_right = 0.0
margin_top = 0.0
margin_bottom = 0.0
expand_margin_left = 0.0
expand_margin_right = 0.0
expand_margin_top = 0.0
expand_margin_bottom = 0.0
draw_center = true

[resource]

Button/colors/font_color = Color( 0, 0, 0, 1 )
Button/colors/font_color_disabled = Color( 0, 0, 0, 0 )
Button/colors/font_color_hover = Color( 1, 1, 1, 1 )
Button/colors/font_color_pressed = Color( 0, 0, 0, 1 )
Button/constants/hseparation = 2
Button/fonts/font = SubResource( 1 )
Button/styles/disabled = SubResource( 2 )
Button/styles/focus = SubResource( 3 )
Button/styles/hover = SubResource( 4 )
Button/styles/normal = SubResource( 5 )
Button/styles/pressed = SubResource( 6 )
