[gd_scene load_steps=3 format=2]

[ext_resource path="res://scripts/translate_me.gd" type="Script" id=1]
[ext_resource path="res://gui/button_small_theme.tres" type="Theme" id=2]

[node name="box1" type="Control"]
margin_right = 180.0
margin_bottom = 80.0
rect_min_size = Vector2( 190, 80 )

[node name="title" type="Label" parent="."]
anchor_right = 1.0
margin_bottom = 32.0
rect_min_size = Vector2( 0, 32 )
mouse_filter = 1
size_flags_vertical = 0
text = "SET TRANS KEY"
align = 1
valign = 1
autowrap = true
uppercase = true
script = ExtResource( 1 )

[node name="buttons" type="CenterContainer" parent="."]
anchor_top = 1.0
anchor_right = 1.0
anchor_bottom = 1.0
margin_top = -48.0
margin_right = -4.0
rect_min_size = Vector2( 0, 32 )

[node name="center" type="Container" parent="buttons"]
margin_left = 93.0
margin_top = 24.0
margin_right = 93.0
margin_bottom = 24.0

[node name="first" type="Button" parent="buttons/center"]
margin_left = -45.0
margin_top = -24.0
margin_right = 45.0
margin_bottom = 24.0
rect_min_size = Vector2( 90, 48 )
theme = ExtResource( 2 )
text = "SET KEY"
script = ExtResource( 1 )
