[gd_resource type="TileSet" load_steps=2 format=2]

[ext_resource path="res://assets/gui/workshop/building_blocks.png" type="Texture" id=1]

[resource]
0/name = "tile1"
0/texture = ExtResource( 1 )
0/tex_offset = Vector2( 0, -14 )
0/modulate = Color( 1, 1, 1, 1 )
0/region = Rect2( 0, 0, 64, 64 )
0/tile_mode = 0
0/occluder_offset = Vector2( 32, 32 )
0/navigation_offset = Vector2( 32, 32 )
0/shape_offset = Vector2( 0, 0 )
0/shape_transform = Transform2D( 1, 0, 0, 1, 0, 0 )
0/shape_one_way = false
0/shape_one_way_margin = 0.0
0/shapes = [  ]
0/z_index = 0
1/name = "tile2"
1/texture = ExtResource( 1 )
1/tex_offset = Vector2( 0, -14 )
1/modulate = Color( 1, 1, 1, 1 )
1/region = Rect2( 64, 0, 64, 64 )
1/tile_mode = 0
1/occluder_offset = Vector2( 32, 32 )
1/navigation_offset = Vector2( 32, 32 )
1/shape_offset = Vector2( 0, 0 )
1/shape_transform = Transform2D( 1, 0, 0, 1, 0, 0 )
1/shape_one_way = false
1/shape_one_way_margin = 0.0
1/shapes = [  ]
1/z_index = 0
2/name = "tile3"
2/texture = ExtResource( 1 )
2/tex_offset = Vector2( 0, -14 )
2/modulate = Color( 1, 1, 1, 1 )
2/region = Rect2( 128, 0, 64, 64 )
2/tile_mode = 0
2/occluder_offset = Vector2( 32, 32 )
2/navigation_offset = Vector2( 32, 32 )
2/shape_offset = Vector2( 0, 0 )
2/shape_transform = Transform2D( 1, 0, 0, 1, 0, 0 )
2/shape_one_way = false
2/shape_one_way_margin = 0.0
2/shapes = [  ]
2/z_index = 0
3/name = "tile4"
3/texture = ExtResource( 1 )
3/tex_offset = Vector2( 0, -14 )
3/modulate = Color( 1, 1, 1, 1 )
3/region = Rect2( 192, 0, 64, 64 )
3/tile_mode = 0
3/occluder_offset = Vector2( 32, 32 )
3/navigation_offset = Vector2( 32, 32 )
3/shape_offset = Vector2( 0, 0 )
3/shape_transform = Transform2D( 1, 0, 0, 1, 0, 0 )
3/shape_one_way = false
3/shape_one_way_margin = 0.0
3/shapes = [  ]
3/z_index = 0
4/name = "tile5"
4/texture = ExtResource( 1 )
4/tex_offset = Vector2( 0, -14 )
4/modulate = Color( 1, 1, 1, 1 )
4/region = Rect2( 256, 0, 64, 64 )
4/tile_mode = 0
4/occluder_offset = Vector2( 32, 32 )
4/navigation_offset = Vector2( 32, 32 )
4/shape_offset = Vector2( 0, 0 )
4/shape_transform = Transform2D( 1, 0, 0, 1, 0, 0 )
4/shape_one_way = false
4/shape_one_way_margin = 0.0
4/shapes = [  ]
4/z_index = 0
5/name = "tile6"
5/texture = ExtResource( 1 )
5/tex_offset = Vector2( 0, -14 )
5/modulate = Color( 1, 1, 1, 1 )
5/region = Rect2( 320, 0, 64, 64 )
5/tile_mode = 0
5/occluder_offset = Vector2( 32, 32 )
5/navigation_offset = Vector2( 32, 32 )
5/shape_offset = Vector2( 0, 0 )
5/shape_transform = Transform2D( 1, 0, 0, 1, 0, 0 )
5/shape_one_way = false
5/shape_one_way_margin = 0.0
5/shapes = [  ]
5/z_index = 0
6/name = "tile7"
6/texture = ExtResource( 1 )
6/tex_offset = Vector2( 0, -14 )
6/modulate = Color( 1, 1, 1, 1 )
6/region = Rect2( 384, 0, 64, 64 )
6/tile_mode = 0
6/occluder_offset = Vector2( 32, 32 )
6/navigation_offset = Vector2( 32, 32 )
6/shape_offset = Vector2( 0, 0 )
6/shape_transform = Transform2D( 1, 0, 0, 1, 0, 0 )
6/shape_one_way = false
6/shape_one_way_margin = 0.0
6/shapes = [  ]
6/z_index = 0
7/name = "tile8"
7/texture = ExtResource( 1 )
7/tex_offset = Vector2( 0, -14 )
7/modulate = Color( 1, 1, 1, 1 )
7/region = Rect2( 448, 0, 64, 64 )
7/tile_mode = 0
7/occluder_offset = Vector2( 32, 32 )
7/navigation_offset = Vector2( 32, 32 )
7/shape_offset = Vector2( 0, 0 )
7/shape_transform = Transform2D( 1, 0, 0, 1, 0, 0 )
7/shape_one_way = false
7/shape_one_way_margin = 0.0
7/shapes = [  ]
7/z_index = 0
8/name = "tile9"
8/texture = ExtResource( 1 )
8/tex_offset = Vector2( 0, -14 )
8/modulate = Color( 1, 1, 1, 1 )
8/region = Rect2( 0, 64, 64, 64 )
8/tile_mode = 0
8/occluder_offset = Vector2( 32, 32 )
8/navigation_offset = Vector2( 32, 32 )
8/shape_offset = Vector2( 0, 0 )
8/shape_transform = Transform2D( 1, 0, 0, 1, 0, 0 )
8/shape_one_way = false
8/shape_one_way_margin = 0.0
8/shapes = [  ]
8/z_index = 0
9/name = "tile10"
9/texture = ExtResource( 1 )
9/tex_offset = Vector2( 0, -14 )
9/modulate = Color( 1, 1, 1, 1 )
9/region = Rect2( 64, 64, 64, 64 )
9/tile_mode = 0
9/occluder_offset = Vector2( 32, 32 )
9/navigation_offset = Vector2( 32, 32 )
9/shape_offset = Vector2( 0, 0 )
9/shape_transform = Transform2D( 1, 0, 0, 1, 0, 0 )
9/shape_one_way = false
9/shape_one_way_margin = 0.0
9/shapes = [  ]
9/z_index = 0
10/name = "tile11"
10/texture = ExtResource( 1 )
10/tex_offset = Vector2( 0, -14 )
10/modulate = Color( 1, 1, 1, 1 )
10/region = Rect2( 128, 64, 64, 64 )
10/tile_mode = 0
10/occluder_offset = Vector2( 32, 32 )
10/navigation_offset = Vector2( 32, 32 )
10/shape_offset = Vector2( 0, 0 )
10/shape_transform = Transform2D( 1, 0, 0, 1, 0, 0 )
10/shape_one_way = false
10/shape_one_way_margin = 0.0
10/shapes = [  ]
10/z_index = 0
11/name = "tile12"
11/texture = ExtResource( 1 )
11/tex_offset = Vector2( 0, -14 )
11/modulate = Color( 1, 1, 1, 1 )
11/region = Rect2( 192, 64, 64, 64 )
11/tile_mode = 0
11/occluder_offset = Vector2( 32, 32 )
11/navigation_offset = Vector2( 32, 32 )
11/shape_offset = Vector2( 0, 0 )
11/shape_transform = Transform2D( 1, 0, 0, 1, 0, 0 )
11/shape_one_way = false
11/shape_one_way_margin = 0.0
11/shapes = [  ]
11/z_index = 0
12/name = "tile13"
12/texture = ExtResource( 1 )
12/tex_offset = Vector2( 0, -14 )
12/modulate = Color( 1, 1, 1, 1 )
12/region = Rect2( 256, 64, 64, 64 )
12/tile_mode = 0
12/occluder_offset = Vector2( 32, 32 )
12/navigation_offset = Vector2( 32, 32 )
12/shape_offset = Vector2( 0, 0 )
12/shape_transform = Transform2D( 1, 0, 0, 1, 0, 0 )
12/shape_one_way = false
12/shape_one_way_margin = 0.0
12/shapes = [  ]
12/z_index = 0
13/name = "tile14"
13/texture = ExtResource( 1 )
13/tex_offset = Vector2( 0, -14 )
13/modulate = Color( 1, 1, 1, 1 )
13/region = Rect2( 320, 64, 64, 64 )
13/tile_mode = 0
13/occluder_offset = Vector2( 32, 32 )
13/navigation_offset = Vector2( 32, 32 )
13/shape_offset = Vector2( 0, 0 )
13/shape_transform = Transform2D( 1, 0, 0, 1, 0, 0 )
13/shape_one_way = false
13/shape_one_way_margin = 0.0
13/shapes = [  ]
13/z_index = 0
14/name = "tile15"
14/texture = ExtResource( 1 )
14/tex_offset = Vector2( 0, -14 )
14/modulate = Color( 1, 1, 1, 1 )
14/region = Rect2( 384, 64, 64, 64 )
14/tile_mode = 0
14/occluder_offset = Vector2( 32, 32 )
14/navigation_offset = Vector2( 32, 32 )
14/shape_offset = Vector2( 0, 0 )
14/shape_transform = Transform2D( 1, 0, 0, 1, 0, 0 )
14/shape_one_way = false
14/shape_one_way_margin = 0.0
14/shapes = [  ]
14/z_index = 0
15/name = "tile16"
15/texture = ExtResource( 1 )
15/tex_offset = Vector2( 0, -14 )
15/modulate = Color( 1, 1, 1, 1 )
15/region = Rect2( 448, 64, 64, 64 )
15/tile_mode = 0
15/occluder_offset = Vector2( 32, 32 )
15/navigation_offset = Vector2( 32, 32 )
15/shape_offset = Vector2( 0, 0 )
15/shape_transform = Transform2D( 1, 0, 0, 1, 0, 0 )
15/shape_one_way = false
15/shape_one_way_margin = 0.0
15/shapes = [  ]
15/z_index = 0
16/name = "tile17"
16/texture = ExtResource( 1 )
16/tex_offset = Vector2( 0, -14 )
16/modulate = Color( 1, 1, 1, 1 )
16/region = Rect2( 0, 128, 64, 64 )
16/tile_mode = 0
16/occluder_offset = Vector2( 32, 32 )
16/navigation_offset = Vector2( 32, 32 )
16/shape_offset = Vector2( 0, 0 )
16/shape_transform = Transform2D( 1, 0, 0, 1, 0, 0 )
16/shape_one_way = false
16/shape_one_way_margin = 0.0
16/shapes = [  ]
16/z_index = 0
17/name = "tile18"
17/texture = ExtResource( 1 )
17/tex_offset = Vector2( 0, -14 )
17/modulate = Color( 1, 1, 1, 1 )
17/region = Rect2( 64, 128, 64, 64 )
17/tile_mode = 0
17/occluder_offset = Vector2( 32, 32 )
17/navigation_offset = Vector2( 32, 32 )
17/shape_offset = Vector2( 0, 0 )
17/shape_transform = Transform2D( 1, 0, 0, 1, 0, 0 )
17/shape_one_way = false
17/shape_one_way_margin = 0.0
17/shapes = [  ]
17/z_index = 0
18/name = "tile19"
18/texture = ExtResource( 1 )
18/tex_offset = Vector2( 0, -14 )
18/modulate = Color( 1, 1, 1, 1 )
18/region = Rect2( 128, 128, 64, 64 )
18/tile_mode = 0
18/occluder_offset = Vector2( 32, 32 )
18/navigation_offset = Vector2( 32, 32 )
18/shape_offset = Vector2( 0, 0 )
18/shape_transform = Transform2D( 1, 0, 0, 1, 0, 0 )
18/shape_one_way = false
18/shape_one_way_margin = 0.0
18/shapes = [  ]
18/z_index = 0
19/name = "tile20"
19/texture = ExtResource( 1 )
19/tex_offset = Vector2( 0, -14 )
19/modulate = Color( 1, 1, 1, 1 )
19/region = Rect2( 192, 128, 64, 64 )
19/tile_mode = 0
19/occluder_offset = Vector2( 32, 32 )
19/navigation_offset = Vector2( 32, 32 )
19/shape_offset = Vector2( 0, 0 )
19/shape_transform = Transform2D( 1, 0, 0, 1, 0, 0 )
19/shape_one_way = false
19/shape_one_way_margin = 0.0
19/shapes = [  ]
19/z_index = 0
20/name = "tile21"
20/texture = ExtResource( 1 )
20/tex_offset = Vector2( 0, -14 )
20/modulate = Color( 1, 1, 1, 1 )
20/region = Rect2( 256, 128, 64, 64 )
20/tile_mode = 0
20/occluder_offset = Vector2( 32, 32 )
20/navigation_offset = Vector2( 32, 32 )
20/shape_offset = Vector2( 0, 0 )
20/shape_transform = Transform2D( 1, 0, 0, 1, 0, 0 )
20/shape_one_way = false
20/shape_one_way_margin = 0.0
20/shapes = [  ]
20/z_index = 0
21/name = "tile22"
21/texture = ExtResource( 1 )
21/tex_offset = Vector2( 0, -14 )
21/modulate = Color( 1, 1, 1, 1 )
21/region = Rect2( 320, 128, 64, 64 )
21/tile_mode = 0
21/occluder_offset = Vector2( 32, 32 )
21/navigation_offset = Vector2( 32, 32 )
21/shape_offset = Vector2( 0, 0 )
21/shape_transform = Transform2D( 1, 0, 0, 1, 0, 0 )
21/shape_one_way = false
21/shape_one_way_margin = 0.0
21/shapes = [  ]
21/z_index = 0
22/name = "tile23"
22/texture = ExtResource( 1 )
22/tex_offset = Vector2( 0, -14 )
22/modulate = Color( 1, 1, 1, 1 )
22/region = Rect2( 384, 128, 64, 64 )
22/tile_mode = 0
22/occluder_offset = Vector2( 32, 32 )
22/navigation_offset = Vector2( 32, 32 )
22/shape_offset = Vector2( 0, 0 )
22/shape_transform = Transform2D( 1, 0, 0, 1, 0, 0 )
22/shape_one_way = false
22/shape_one_way_margin = 0.0
22/shapes = [  ]
22/z_index = 0
23/name = "tile24"
23/texture = ExtResource( 1 )
23/tex_offset = Vector2( 0, -14 )
23/modulate = Color( 1, 1, 1, 1 )
23/region = Rect2( 448, 128, 64, 64 )
23/tile_mode = 0
23/occluder_offset = Vector2( 32, 32 )
23/navigation_offset = Vector2( 32, 32 )
23/shape_offset = Vector2( 0, 0 )
23/shape_transform = Transform2D( 1, 0, 0, 1, 0, 0 )
23/shape_one_way = false
23/shape_one_way_margin = 0.0
23/shapes = [  ]
23/z_index = 0
24/name = "tile25"
24/texture = ExtResource( 1 )
24/tex_offset = Vector2( 0, -14 )
24/modulate = Color( 1, 1, 1, 1 )
24/region = Rect2( 0, 192, 64, 64 )
24/tile_mode = 0
24/occluder_offset = Vector2( 32, 32 )
24/navigation_offset = Vector2( 32, 32 )
24/shape_offset = Vector2( 0, 0 )
24/shape_transform = Transform2D( 1, 0, 0, 1, 0, 0 )
24/shape_one_way = false
24/shape_one_way_margin = 0.0
24/shapes = [  ]
24/z_index = 0
25/name = "tile26"
25/texture = ExtResource( 1 )
25/tex_offset = Vector2( 0, -14 )
25/modulate = Color( 1, 1, 1, 1 )
25/region = Rect2( 64, 192, 64, 64 )
25/tile_mode = 0
25/occluder_offset = Vector2( 32, 32 )
25/navigation_offset = Vector2( 32, 32 )
25/shape_offset = Vector2( 0, 0 )
25/shape_transform = Transform2D( 1, 0, 0, 1, 0, 0 )
25/shape_one_way = false
25/shape_one_way_margin = 0.0
25/shapes = [  ]
25/z_index = 0
26/name = "tile27"
26/texture = ExtResource( 1 )
26/tex_offset = Vector2( 0, -14 )
26/modulate = Color( 1, 1, 1, 1 )
26/region = Rect2( 128, 192, 64, 64 )
26/tile_mode = 0
26/occluder_offset = Vector2( 32, 32 )
26/navigation_offset = Vector2( 32, 32 )
26/shape_offset = Vector2( 0, 0 )
26/shape_transform = Transform2D( 1, 0, 0, 1, 0, 0 )
26/shape_one_way = false
26/shape_one_way_margin = 0.0
26/shapes = [  ]
26/z_index = 0
27/name = "tile28"
27/texture = ExtResource( 1 )
27/tex_offset = Vector2( 0, -14 )
27/modulate = Color( 1, 1, 1, 1 )
27/region = Rect2( 192, 192, 64, 64 )
27/tile_mode = 0
27/occluder_offset = Vector2( 32, 32 )
27/navigation_offset = Vector2( 32, 32 )
27/shape_offset = Vector2( 0, 0 )
27/shape_transform = Transform2D( 1, 0, 0, 1, 0, 0 )
27/shape_one_way = false
27/shape_one_way_margin = 0.0
27/shapes = [  ]
27/z_index = 0
28/name = "tile29"
28/texture = ExtResource( 1 )
28/tex_offset = Vector2( 0, -14 )
28/modulate = Color( 1, 1, 1, 1 )
28/region = Rect2( 256, 192, 64, 64 )
28/tile_mode = 0
28/occluder_offset = Vector2( 32, 32 )
28/navigation_offset = Vector2( 32, 32 )
28/shape_offset = Vector2( 0, 0 )
28/shape_transform = Transform2D( 1, 0, 0, 1, 0, 0 )
28/shape_one_way = false
28/shape_one_way_margin = 0.0
28/shapes = [  ]
28/z_index = 0
29/name = "tile30"
29/texture = ExtResource( 1 )
29/tex_offset = Vector2( 0, -14 )
29/modulate = Color( 1, 1, 1, 1 )
29/region = Rect2( 320, 192, 64, 64 )
29/tile_mode = 0
29/occluder_offset = Vector2( 32, 32 )
29/navigation_offset = Vector2( 32, 32 )
29/shape_offset = Vector2( 0, 0 )
29/shape_transform = Transform2D( 1, 0, 0, 1, 0, 0 )
29/shape_one_way = false
29/shape_one_way_margin = 0.0
29/shapes = [  ]
29/z_index = 0
30/name = "tile31"
30/texture = ExtResource( 1 )
30/tex_offset = Vector2( 0, -14 )
30/modulate = Color( 1, 1, 1, 1 )
30/region = Rect2( 384, 192, 64, 64 )
30/tile_mode = 0
30/occluder_offset = Vector2( 32, 32 )
30/navigation_offset = Vector2( 32, 32 )
30/shape_offset = Vector2( 0, 0 )
30/shape_transform = Transform2D( 1, 0, 0, 1, 0, 0 )
30/shape_one_way = false
30/shape_one_way_margin = 0.0
30/shapes = [  ]
30/z_index = 0
31/name = "tile32"
31/texture = ExtResource( 1 )
31/tex_offset = Vector2( 0, -14 )
31/modulate = Color( 1, 1, 1, 1 )
31/region = Rect2( 448, 192, 64, 64 )
31/tile_mode = 0
31/occluder_offset = Vector2( 32, 32 )
31/navigation_offset = Vector2( 32, 32 )
31/shape_offset = Vector2( 0, 0 )
31/shape_transform = Transform2D( 1, 0, 0, 1, 0, 0 )
31/shape_one_way = false
31/shape_one_way_margin = 0.0
31/shapes = [  ]
31/z_index = 0
32/name = "tile33"
32/texture = ExtResource( 1 )
32/tex_offset = Vector2( 0, -14 )
32/modulate = Color( 1, 1, 1, 1 )
32/region = Rect2( 0, 256, 64, 64 )
32/tile_mode = 0
32/occluder_offset = Vector2( 32, 32 )
32/navigation_offset = Vector2( 32, 32 )
32/shape_offset = Vector2( 0, 0 )
32/shape_transform = Transform2D( 1, 0, 0, 1, 0, 0 )
32/shape_one_way = false
32/shape_one_way_margin = 0.0
32/shapes = [  ]
32/z_index = 0
33/name = "tile34"
33/texture = ExtResource( 1 )
33/tex_offset = Vector2( 0, -14 )
33/modulate = Color( 1, 1, 1, 1 )
33/region = Rect2( 64, 256, 64, 64 )
33/tile_mode = 0
33/occluder_offset = Vector2( 32, 32 )
33/navigation_offset = Vector2( 32, 32 )
33/shape_offset = Vector2( 0, 0 )
33/shape_transform = Transform2D( 1, 0, 0, 1, 0, 0 )
33/shape_one_way = false
33/shape_one_way_margin = 0.0
33/shapes = [  ]
33/z_index = 0
34/name = "tile35"
34/texture = ExtResource( 1 )
34/tex_offset = Vector2( 0, -14 )
34/modulate = Color( 1, 1, 1, 1 )
34/region = Rect2( 128, 256, 64, 64 )
34/tile_mode = 0
34/occluder_offset = Vector2( 32, 32 )
34/navigation_offset = Vector2( 32, 32 )
34/shape_offset = Vector2( 0, 0 )
34/shape_transform = Transform2D( 1, 0, 0, 1, 0, 0 )
34/shape_one_way = false
34/shape_one_way_margin = 0.0
34/shapes = [  ]
34/z_index = 0
