-- Merging decision tree log ---
meta-data#org.godotengine.editor.version
INJECTED from /home/kura/Stage/Artiphonie-app/android/build/AndroidManifest.xml:34:9-36:53
	android:value
		INJECTED from /home/kura/Stage/Artiphonie-app/android/build/AndroidManifest.xml
manifest
ADDED from /home/kura/Stage/Artiphonie-app/android/build/AndroidManifest.xml:2:1-89:12
INJECTED from /home/kura/Stage/Artiphonie-app/android/build/AndroidManifest.xml:2:1-89:12
INJECTED from /home/kura/Stage/Artiphonie-app/android/build/AndroidManifest.xml:2:1-89:12
INJECTED from /home/kura/Stage/Artiphonie-app/android/build/AndroidManifest.xml:2:1-89:12
MERGED from /home/kura/Stage/Artiphonie-app/android/build/AndroidManifest.xml:2:1-89:12
MERGED from [GodotTTS.1.0.0.release.aar] /home/kura/.gradle/caches/transforms-3/22b5d45566d39cf44dfdeff26ef272b6/transformed/jetified-GodotTTS.1.0.0.release/AndroidManifest.xml:2:1-15:12
MERGED from [godot-lib.release.aar] /home/kura/.gradle/caches/transforms-3/116885a8b5e7a96710277a2f2a84ccfd/transformed/jetified-godot-lib.release/AndroidManifest.xml:2:1-26:12
MERGED from [androidx.fragment:fragment:1.3.6] /home/kura/.gradle/caches/transforms-3/c2360f94ab91eece4613c81da4a23fd6/transformed/fragment-1.3.6/AndroidManifest.xml:17:1-24:12
MERGED from [androidx.viewpager:viewpager:1.0.0] /home/kura/.gradle/caches/transforms-3/ae3fbadc527e526ea5178b93d973b3e5/transformed/viewpager-1.0.0/AndroidManifest.xml:17:1-22:12
MERGED from [androidx.loader:loader:1.0.0] /home/kura/.gradle/caches/transforms-3/87a5387960006505e1c02caa224b4e0a/transformed/loader-1.0.0/AndroidManifest.xml:17:1-22:12
MERGED from [androidx.activity:activity:1.2.4] /home/kura/.gradle/caches/transforms-3/cc28bace99ed8c7c16f24fc8336ce36d/transformed/jetified-activity-1.2.4/AndroidManifest.xml:17:1-24:12
MERGED from [androidx.customview:customview:1.0.0] /home/kura/.gradle/caches/transforms-3/359adf91547a71872372ac71cad67528/transformed/customview-1.0.0/AndroidManifest.xml:17:1-22:12
MERGED from [androidx.core:core:1.2.0] /home/kura/.gradle/caches/transforms-3/f468396e8f36529b92fb98842a149f3b/transformed/core-1.2.0/AndroidManifest.xml:17:1-26:12
MERGED from [androidx.versionedparcelable:versionedparcelable:1.1.0] /home/kura/.gradle/caches/transforms-3/bf21ca953b3075d7a19bd639e0398674/transformed/versionedparcelable-1.1.0/AndroidManifest.xml:17:1-27:12
MERGED from [androidx.lifecycle:lifecycle-viewmodel-savedstate:2.3.1] /home/kura/.gradle/caches/transforms-3/f800cc5bc15479afb91d2104f16f7dd3/transformed/jetified-lifecycle-viewmodel-savedstate-2.3.1/AndroidManifest.xml:17:1-24:12
MERGED from [androidx.lifecycle:lifecycle-viewmodel:2.3.1] /home/kura/.gradle/caches/transforms-3/09084ebbec1c08fe7d13e83831c88b99/transformed/lifecycle-viewmodel-2.3.1/AndroidManifest.xml:17:1-24:12
MERGED from [androidx.savedstate:savedstate:1.1.0] /home/kura/.gradle/caches/transforms-3/e956910f53c17cbe7384ae9f6e35d06c/transformed/jetified-savedstate-1.1.0/AndroidManifest.xml:17:1-24:12
MERGED from [androidx.lifecycle:lifecycle-runtime:2.3.1] /home/kura/.gradle/caches/transforms-3/05648226be1339204aad113ba41ba427/transformed/lifecycle-runtime-2.3.1/AndroidManifest.xml:17:1-24:12
MERGED from [androidx.tracing:tracing:1.0.0] /home/kura/.gradle/caches/transforms-3/5bd16b32568cadccecad884eef2d8bac/transformed/jetified-tracing-1.0.0/AndroidManifest.xml:17:1-24:12
MERGED from [androidx.lifecycle:lifecycle-livedata:2.0.0] /home/kura/.gradle/caches/transforms-3/c5826957b368913e7895b22837b64684/transformed/lifecycle-livedata-2.0.0/AndroidManifest.xml:17:1-22:12
MERGED from [androidx.lifecycle:lifecycle-livedata-core:2.3.1] /home/kura/.gradle/caches/transforms-3/7d9ba74b9597ce35c6ef51a7859c1ef6/transformed/lifecycle-livedata-core-2.3.1/AndroidManifest.xml:17:1-24:12
MERGED from [androidx.arch.core:core-runtime:2.1.0] /home/kura/.gradle/caches/transforms-3/c87a716243e7a9480128d75620d71b97/transformed/core-runtime-2.1.0/AndroidManifest.xml:17:1-24:12
MERGED from [androidx.annotation:annotation-experimental:1.0.0] /home/kura/.gradle/caches/transforms-3/b13813e9af3a4a27dcf0caa0be9c343d/transformed/jetified-annotation-experimental-1.0.0/AndroidManifest.xml:17:1-24:12
INJECTED from /home/kura/Stage/Artiphonie-app/android/build/src/release/AndroidManifest.xml:2:1-36:12
INJECTED from /home/kura/Stage/Artiphonie-app/android/build/src/release/AndroidManifest.xml:2:1-36:12
INJECTED from /home/kura/Stage/Artiphonie-app/android/build/src/release/AndroidManifest.xml:2:1-36:12
	package
		ADDED from /home/kura/Stage/Artiphonie-app/android/build/AndroidManifest.xml:4:5-29
		INJECTED from /home/kura/Stage/Artiphonie-app/android/build/AndroidManifest.xml
		ADDED from /home/kura/Stage/Artiphonie-app/android/build/AndroidManifest.xml:4:5-29
		INJECTED from /home/kura/Stage/Artiphonie-app/android/build/src/release/AndroidManifest.xml
	android:versionName
		ADDED from /home/kura/Stage/Artiphonie-app/android/build/AndroidManifest.xml:6:5-30
		INJECTED from /home/kura/Stage/Artiphonie-app/android/build/AndroidManifest.xml
		ADDED from /home/kura/Stage/Artiphonie-app/android/build/AndroidManifest.xml:6:5-30
		INJECTED from /home/kura/Stage/Artiphonie-app/android/build/src/release/AndroidManifest.xml
	xmlns:tools
		ADDED from /home/kura/Stage/Artiphonie-app/android/build/AndroidManifest.xml:3:5-51
	xmlns:android
		ADDED from /home/kura/Stage/Artiphonie-app/android/build/AndroidManifest.xml:2:11-69
	android:versionCode
		ADDED from /home/kura/Stage/Artiphonie-app/android/build/AndroidManifest.xml:5:5-28
		INJECTED from /home/kura/Stage/Artiphonie-app/android/build/AndroidManifest.xml
		ADDED from /home/kura/Stage/Artiphonie-app/android/build/AndroidManifest.xml:5:5-28
		INJECTED from /home/kura/Stage/Artiphonie-app/android/build/src/release/AndroidManifest.xml
	android:installLocation
		ADDED from /home/kura/Stage/Artiphonie-app/android/build/AndroidManifest.xml:7:5-35
		ADDED from /home/kura/Stage/Artiphonie-app/android/build/AndroidManifest.xml:7:5-35
supports-screens
ADDED from /home/kura/Stage/Artiphonie-app/android/build/AndroidManifest.xml:12:5-16:40
REJECTED from /home/kura/Stage/Artiphonie-app/android/build/AndroidManifest.xml:12:5-16:40
	tools:node
		ADDED from /home/kura/Stage/Artiphonie-app/android/build/src/release/AndroidManifest.xml:5:9-29
	android:largeScreens
		ADDED from /home/kura/Stage/Artiphonie-app/android/build/AndroidManifest.xml:15:9-36
	android:smallScreens
		ADDED from /home/kura/Stage/Artiphonie-app/android/build/AndroidManifest.xml:13:9-36
	android:normalScreens
		ADDED from /home/kura/Stage/Artiphonie-app/android/build/AndroidManifest.xml:14:9-37
	android:xlargeScreens
		ADDED from /home/kura/Stage/Artiphonie-app/android/build/AndroidManifest.xml:16:9-37
uses-feature#0x00020000
ADDED from /home/kura/Stage/Artiphonie-app/android/build/AndroidManifest.xml:19:5-21:35
REJECTED from /home/kura/Stage/Artiphonie-app/android/build/src/release/AndroidManifest.xml:19:5-21:35
	android:glEsVersion
		ADDED from /home/kura/Stage/Artiphonie-app/android/build/AndroidManifest.xml:20:9-41
	android:required
		ADDED from /home/kura/Stage/Artiphonie-app/android/build/AndroidManifest.xml:21:9-32
application
ADDED from /home/kura/Stage/Artiphonie-app/android/build/AndroidManifest.xml:31:5-87:19
MERGED from /home/kura/Stage/Artiphonie-app/android/build/AndroidManifest.xml:31:5-87:19
MERGED from /home/kura/Stage/Artiphonie-app/android/build/AndroidManifest.xml:31:5-87:19
MERGED from [GodotTTS.1.0.0.release.aar] /home/kura/.gradle/caches/transforms-3/22b5d45566d39cf44dfdeff26ef272b6/transformed/jetified-GodotTTS.1.0.0.release/AndroidManifest.xml:9:5-13:19
MERGED from [GodotTTS.1.0.0.release.aar] /home/kura/.gradle/caches/transforms-3/22b5d45566d39cf44dfdeff26ef272b6/transformed/jetified-GodotTTS.1.0.0.release/AndroidManifest.xml:9:5-13:19
MERGED from [godot-lib.release.aar] /home/kura/.gradle/caches/transforms-3/116885a8b5e7a96710277a2f2a84ccfd/transformed/jetified-godot-lib.release/AndroidManifest.xml:16:5-24:19
MERGED from [godot-lib.release.aar] /home/kura/.gradle/caches/transforms-3/116885a8b5e7a96710277a2f2a84ccfd/transformed/jetified-godot-lib.release/AndroidManifest.xml:16:5-24:19
MERGED from [androidx.core:core:1.2.0] /home/kura/.gradle/caches/transforms-3/f468396e8f36529b92fb98842a149f3b/transformed/core-1.2.0/AndroidManifest.xml:24:5-89
MERGED from [androidx.core:core:1.2.0] /home/kura/.gradle/caches/transforms-3/f468396e8f36529b92fb98842a149f3b/transformed/core-1.2.0/AndroidManifest.xml:24:5-89
MERGED from [androidx.versionedparcelable:versionedparcelable:1.1.0] /home/kura/.gradle/caches/transforms-3/bf21ca953b3075d7a19bd639e0398674/transformed/versionedparcelable-1.1.0/AndroidManifest.xml:24:5-25:19
MERGED from [androidx.versionedparcelable:versionedparcelable:1.1.0] /home/kura/.gradle/caches/transforms-3/bf21ca953b3075d7a19bd639e0398674/transformed/versionedparcelable-1.1.0/AndroidManifest.xml:24:5-25:19
	android:requestLegacyExternalStorage
		ADDED from /home/kura/Stage/Artiphonie-app/android/build/AndroidManifest.xml:31:153-197
		REJECTED from /home/kura/Stage/Artiphonie-app/android/build/AndroidManifest.xml:31:153-197
	android:appComponentFactory
		ADDED from [androidx.core:core:1.2.0] /home/kura/.gradle/caches/transforms-3/f468396e8f36529b92fb98842a149f3b/transformed/core-1.2.0/AndroidManifest.xml:24:18-86
	android:label
		ADDED from /home/kura/Stage/Artiphonie-app/android/build/AndroidManifest.xml:31:18-67
	tools:ignore
		ADDED from /home/kura/Stage/Artiphonie-app/android/build/AndroidManifest.xml:31:198-237
	android:icon
		ADDED from /home/kura/Stage/Artiphonie-app/android/build/AndroidManifest.xml:31:238-265
	android:allowBackup
		ADDED from /home/kura/Stage/Artiphonie-app/android/build/AndroidManifest.xml:31:68-95
		REJECTED from /home/kura/Stage/Artiphonie-app/android/build/AndroidManifest.xml:31:68-95
	tools:replace
		ADDED from /home/kura/Stage/Artiphonie-app/android/build/src/release/AndroidManifest.xml:25:9-123
	android:isGame
		ADDED from /home/kura/Stage/Artiphonie-app/android/build/AndroidManifest.xml:31:96-117
		REJECTED from /home/kura/Stage/Artiphonie-app/android/build/AndroidManifest.xml:31:96-117
	android:hasFragileUserData
		ADDED from /home/kura/Stage/Artiphonie-app/android/build/AndroidManifest.xml:31:118-152
		REJECTED from /home/kura/Stage/Artiphonie-app/android/build/AndroidManifest.xml:31:118-152
meta-data#xr_mode_metadata_name
ADDED from /home/kura/Stage/Artiphonie-app/android/build/AndroidManifest.xml:42:9-44:54
REJECTED from /home/kura/Stage/Artiphonie-app/android/build/AndroidManifest.xml:42:9-44:54
	tools:node
		ADDED from /home/kura/Stage/Artiphonie-app/android/build/src/release/AndroidManifest.xml:29:20-39
	android:value
		ADDED from /home/kura/Stage/Artiphonie-app/android/build/AndroidManifest.xml:44:13-51
	android:name
		ADDED from /home/kura/Stage/Artiphonie-app/android/build/AndroidManifest.xml:43:13-49
meta-data#xr_hand_tracking_metadata_name
ADDED from /home/kura/Stage/Artiphonie-app/android/build/AndroidManifest.xml:49:9-51:62
REJECTED from /home/kura/Stage/Artiphonie-app/android/build/AndroidManifest.xml:49:9-51:62
	tools:node
		ADDED from /home/kura/Stage/Artiphonie-app/android/build/src/release/AndroidManifest.xml:30:20-39
	android:value
		ADDED from /home/kura/Stage/Artiphonie-app/android/build/AndroidManifest.xml:51:13-60
	android:name
		ADDED from /home/kura/Stage/Artiphonie-app/android/build/AndroidManifest.xml:50:13-58
meta-data#com.oculus.supportedDevices
ADDED from /home/kura/Stage/Artiphonie-app/android/build/AndroidManifest.xml:55:9-57:35
REJECTED from /home/kura/Stage/Artiphonie-app/android/build/AndroidManifest.xml:55:9-57:35
	tools:node
		ADDED from /home/kura/Stage/Artiphonie-app/android/build/src/release/AndroidManifest.xml:31:20-39
	android:value
		ADDED from /home/kura/Stage/Artiphonie-app/android/build/AndroidManifest.xml:57:13-32
	android:name
		ADDED from /home/kura/Stage/Artiphonie-app/android/build/AndroidManifest.xml:56:13-55
activity#com.godot.game.GodotApp
ADDED from /home/kura/Stage/Artiphonie-app/android/build/AndroidManifest.xml:59:9-81:20
MERGED from /home/kura/Stage/Artiphonie-app/android/build/AndroidManifest.xml:59:9-81:20
MERGED from /home/kura/Stage/Artiphonie-app/android/build/AndroidManifest.xml:59:9-81:20
	android:screenOrientation
		ADDED from /home/kura/Stage/Artiphonie-app/android/build/AndroidManifest.xml:65:13-50
		REJECTED from /home/kura/Stage/Artiphonie-app/android/build/AndroidManifest.xml:65:13-50
	android:label
		ADDED from /home/kura/Stage/Artiphonie-app/android/build/AndroidManifest.xml:61:13-62
		ADDED from /home/kura/Stage/Artiphonie-app/android/build/AndroidManifest.xml:61:13-62
	android:excludeFromRecents
		ADDED from /home/kura/Stage/Artiphonie-app/android/build/AndroidManifest.xml:64:13-47
		REJECTED from /home/kura/Stage/Artiphonie-app/android/build/AndroidManifest.xml:64:13-47
	android:launchMode
		ADDED from /home/kura/Stage/Artiphonie-app/android/build/AndroidManifest.xml:63:13-44
		ADDED from /home/kura/Stage/Artiphonie-app/android/build/AndroidManifest.xml:63:13-44
	android:resizeableActivity
		ADDED from /home/kura/Stage/Artiphonie-app/android/build/AndroidManifest.xml:67:13-47
		ADDED from /home/kura/Stage/Artiphonie-app/android/build/AndroidManifest.xml:67:13-47
	tools:ignore
		ADDED from /home/kura/Stage/Artiphonie-app/android/build/AndroidManifest.xml:68:13-43
		ADDED from /home/kura/Stage/Artiphonie-app/android/build/AndroidManifest.xml:68:13-43
	android:configChanges
		ADDED from /home/kura/Stage/Artiphonie-app/android/build/AndroidManifest.xml:66:13-141
		ADDED from /home/kura/Stage/Artiphonie-app/android/build/AndroidManifest.xml:66:13-141
	android:theme
		ADDED from /home/kura/Stage/Artiphonie-app/android/build/AndroidManifest.xml:62:13-55
		ADDED from /home/kura/Stage/Artiphonie-app/android/build/AndroidManifest.xml:62:13-55
	tools:replace
		ADDED from /home/kura/Stage/Artiphonie-app/android/build/src/release/AndroidManifest.xml:32:58-126
	android:name
		ADDED from /home/kura/Stage/Artiphonie-app/android/build/AndroidManifest.xml:60:13-37
meta-data#com.oculus.vr.focusaware
ADDED from /home/kura/Stage/Artiphonie-app/android/build/AndroidManifest.xml:71:13-87
REJECTED from /home/kura/Stage/Artiphonie-app/android/build/AndroidManifest.xml:71:13-87
	tools:node
		ADDED from /home/kura/Stage/Artiphonie-app/android/build/src/release/AndroidManifest.xml:33:24-43
	android:value
		ADDED from /home/kura/Stage/Artiphonie-app/android/build/AndroidManifest.xml:71:64-84
	android:name
		ADDED from /home/kura/Stage/Artiphonie-app/android/build/AndroidManifest.xml:71:24-63
intent-filter#action:name:android.intent.action.MAIN+category:name:android.intent.category.LAUNCHER+category:name:com.oculus.intent.category.VR
ADDED from /home/kura/Stage/Artiphonie-app/android/build/AndroidManifest.xml:73:13-80:29
action#android.intent.action.MAIN
ADDED from /home/kura/Stage/Artiphonie-app/android/build/AndroidManifest.xml:74:17-69
	android:name
		ADDED from /home/kura/Stage/Artiphonie-app/android/build/AndroidManifest.xml:74:25-66
category#android.intent.category.LAUNCHER
ADDED from /home/kura/Stage/Artiphonie-app/android/build/AndroidManifest.xml:75:17-77
	android:name
		ADDED from /home/kura/Stage/Artiphonie-app/android/build/AndroidManifest.xml:75:27-74
category#com.oculus.intent.category.VR
ADDED from /home/kura/Stage/Artiphonie-app/android/build/AndroidManifest.xml:79:17-74
	android:name
		ADDED from /home/kura/Stage/Artiphonie-app/android/build/AndroidManifest.xml:79:27-71
uses-sdk
INJECTED from /home/kura/Stage/Artiphonie-app/android/build/AndroidManifest.xml reason: use-sdk injection requested
INJECTED from /home/kura/Stage/Artiphonie-app/android/build/AndroidManifest.xml
INJECTED from /home/kura/Stage/Artiphonie-app/android/build/AndroidManifest.xml
MERGED from [GodotTTS.1.0.0.release.aar] /home/kura/.gradle/caches/transforms-3/22b5d45566d39cf44dfdeff26ef272b6/transformed/jetified-GodotTTS.1.0.0.release/AndroidManifest.xml:5:5-7:41
MERGED from [GodotTTS.1.0.0.release.aar] /home/kura/.gradle/caches/transforms-3/22b5d45566d39cf44dfdeff26ef272b6/transformed/jetified-GodotTTS.1.0.0.release/AndroidManifest.xml:5:5-7:41
MERGED from [godot-lib.release.aar] /home/kura/.gradle/caches/transforms-3/116885a8b5e7a96710277a2f2a84ccfd/transformed/jetified-godot-lib.release/AndroidManifest.xml:6:5-8:41
MERGED from [godot-lib.release.aar] /home/kura/.gradle/caches/transforms-3/116885a8b5e7a96710277a2f2a84ccfd/transformed/jetified-godot-lib.release/AndroidManifest.xml:6:5-8:41
MERGED from [androidx.fragment:fragment:1.3.6] /home/kura/.gradle/caches/transforms-3/c2360f94ab91eece4613c81da4a23fd6/transformed/fragment-1.3.6/AndroidManifest.xml:20:5-22:41
MERGED from [androidx.fragment:fragment:1.3.6] /home/kura/.gradle/caches/transforms-3/c2360f94ab91eece4613c81da4a23fd6/transformed/fragment-1.3.6/AndroidManifest.xml:20:5-22:41
MERGED from [androidx.viewpager:viewpager:1.0.0] /home/kura/.gradle/caches/transforms-3/ae3fbadc527e526ea5178b93d973b3e5/transformed/viewpager-1.0.0/AndroidManifest.xml:20:5-44
MERGED from [androidx.viewpager:viewpager:1.0.0] /home/kura/.gradle/caches/transforms-3/ae3fbadc527e526ea5178b93d973b3e5/transformed/viewpager-1.0.0/AndroidManifest.xml:20:5-44
MERGED from [androidx.loader:loader:1.0.0] /home/kura/.gradle/caches/transforms-3/87a5387960006505e1c02caa224b4e0a/transformed/loader-1.0.0/AndroidManifest.xml:20:5-44
MERGED from [androidx.loader:loader:1.0.0] /home/kura/.gradle/caches/transforms-3/87a5387960006505e1c02caa224b4e0a/transformed/loader-1.0.0/AndroidManifest.xml:20:5-44
MERGED from [androidx.activity:activity:1.2.4] /home/kura/.gradle/caches/transforms-3/cc28bace99ed8c7c16f24fc8336ce36d/transformed/jetified-activity-1.2.4/AndroidManifest.xml:20:5-22:41
MERGED from [androidx.activity:activity:1.2.4] /home/kura/.gradle/caches/transforms-3/cc28bace99ed8c7c16f24fc8336ce36d/transformed/jetified-activity-1.2.4/AndroidManifest.xml:20:5-22:41
MERGED from [androidx.customview:customview:1.0.0] /home/kura/.gradle/caches/transforms-3/359adf91547a71872372ac71cad67528/transformed/customview-1.0.0/AndroidManifest.xml:20:5-44
MERGED from [androidx.customview:customview:1.0.0] /home/kura/.gradle/caches/transforms-3/359adf91547a71872372ac71cad67528/transformed/customview-1.0.0/AndroidManifest.xml:20:5-44
MERGED from [androidx.core:core:1.2.0] /home/kura/.gradle/caches/transforms-3/f468396e8f36529b92fb98842a149f3b/transformed/core-1.2.0/AndroidManifest.xml:20:5-22:41
MERGED from [androidx.core:core:1.2.0] /home/kura/.gradle/caches/transforms-3/f468396e8f36529b92fb98842a149f3b/transformed/core-1.2.0/AndroidManifest.xml:20:5-22:41
MERGED from [androidx.versionedparcelable:versionedparcelable:1.1.0] /home/kura/.gradle/caches/transforms-3/bf21ca953b3075d7a19bd639e0398674/transformed/versionedparcelable-1.1.0/AndroidManifest.xml:20:5-22:41
MERGED from [androidx.versionedparcelable:versionedparcelable:1.1.0] /home/kura/.gradle/caches/transforms-3/bf21ca953b3075d7a19bd639e0398674/transformed/versionedparcelable-1.1.0/AndroidManifest.xml:20:5-22:41
MERGED from [androidx.lifecycle:lifecycle-viewmodel-savedstate:2.3.1] /home/kura/.gradle/caches/transforms-3/f800cc5bc15479afb91d2104f16f7dd3/transformed/jetified-lifecycle-viewmodel-savedstate-2.3.1/AndroidManifest.xml:20:5-22:41
MERGED from [androidx.lifecycle:lifecycle-viewmodel-savedstate:2.3.1] /home/kura/.gradle/caches/transforms-3/f800cc5bc15479afb91d2104f16f7dd3/transformed/jetified-lifecycle-viewmodel-savedstate-2.3.1/AndroidManifest.xml:20:5-22:41
MERGED from [androidx.lifecycle:lifecycle-viewmodel:2.3.1] /home/kura/.gradle/caches/transforms-3/09084ebbec1c08fe7d13e83831c88b99/transformed/lifecycle-viewmodel-2.3.1/AndroidManifest.xml:20:5-22:41
MERGED from [androidx.lifecycle:lifecycle-viewmodel:2.3.1] /home/kura/.gradle/caches/transforms-3/09084ebbec1c08fe7d13e83831c88b99/transformed/lifecycle-viewmodel-2.3.1/AndroidManifest.xml:20:5-22:41
MERGED from [androidx.savedstate:savedstate:1.1.0] /home/kura/.gradle/caches/transforms-3/e956910f53c17cbe7384ae9f6e35d06c/transformed/jetified-savedstate-1.1.0/AndroidManifest.xml:20:5-22:41
MERGED from [androidx.savedstate:savedstate:1.1.0] /home/kura/.gradle/caches/transforms-3/e956910f53c17cbe7384ae9f6e35d06c/transformed/jetified-savedstate-1.1.0/AndroidManifest.xml:20:5-22:41
MERGED from [androidx.lifecycle:lifecycle-runtime:2.3.1] /home/kura/.gradle/caches/transforms-3/05648226be1339204aad113ba41ba427/transformed/lifecycle-runtime-2.3.1/AndroidManifest.xml:20:5-22:41
MERGED from [androidx.lifecycle:lifecycle-runtime:2.3.1] /home/kura/.gradle/caches/transforms-3/05648226be1339204aad113ba41ba427/transformed/lifecycle-runtime-2.3.1/AndroidManifest.xml:20:5-22:41
MERGED from [androidx.tracing:tracing:1.0.0] /home/kura/.gradle/caches/transforms-3/5bd16b32568cadccecad884eef2d8bac/transformed/jetified-tracing-1.0.0/AndroidManifest.xml:20:5-22:41
MERGED from [androidx.tracing:tracing:1.0.0] /home/kura/.gradle/caches/transforms-3/5bd16b32568cadccecad884eef2d8bac/transformed/jetified-tracing-1.0.0/AndroidManifest.xml:20:5-22:41
MERGED from [androidx.lifecycle:lifecycle-livedata:2.0.0] /home/kura/.gradle/caches/transforms-3/c5826957b368913e7895b22837b64684/transformed/lifecycle-livedata-2.0.0/AndroidManifest.xml:20:5-44
MERGED from [androidx.lifecycle:lifecycle-livedata:2.0.0] /home/kura/.gradle/caches/transforms-3/c5826957b368913e7895b22837b64684/transformed/lifecycle-livedata-2.0.0/AndroidManifest.xml:20:5-44
MERGED from [androidx.lifecycle:lifecycle-livedata-core:2.3.1] /home/kura/.gradle/caches/transforms-3/7d9ba74b9597ce35c6ef51a7859c1ef6/transformed/lifecycle-livedata-core-2.3.1/AndroidManifest.xml:20:5-22:41
MERGED from [androidx.lifecycle:lifecycle-livedata-core:2.3.1] /home/kura/.gradle/caches/transforms-3/7d9ba74b9597ce35c6ef51a7859c1ef6/transformed/lifecycle-livedata-core-2.3.1/AndroidManifest.xml:20:5-22:41
MERGED from [androidx.arch.core:core-runtime:2.1.0] /home/kura/.gradle/caches/transforms-3/c87a716243e7a9480128d75620d71b97/transformed/core-runtime-2.1.0/AndroidManifest.xml:20:5-22:41
MERGED from [androidx.arch.core:core-runtime:2.1.0] /home/kura/.gradle/caches/transforms-3/c87a716243e7a9480128d75620d71b97/transformed/core-runtime-2.1.0/AndroidManifest.xml:20:5-22:41
MERGED from [androidx.annotation:annotation-experimental:1.0.0] /home/kura/.gradle/caches/transforms-3/b13813e9af3a4a27dcf0caa0be9c343d/transformed/jetified-annotation-experimental-1.0.0/AndroidManifest.xml:20:5-22:41
MERGED from [androidx.annotation:annotation-experimental:1.0.0] /home/kura/.gradle/caches/transforms-3/b13813e9af3a4a27dcf0caa0be9c343d/transformed/jetified-annotation-experimental-1.0.0/AndroidManifest.xml:20:5-22:41
INJECTED from /home/kura/Stage/Artiphonie-app/android/build/src/release/AndroidManifest.xml
INJECTED from /home/kura/Stage/Artiphonie-app/android/build/src/release/AndroidManifest.xml
	android:targetSdkVersion
		INJECTED from /home/kura/Stage/Artiphonie-app/android/build/AndroidManifest.xml
		INJECTED from /home/kura/Stage/Artiphonie-app/android/build/src/release/AndroidManifest.xml
	android:minSdkVersion
		INJECTED from /home/kura/Stage/Artiphonie-app/android/build/AndroidManifest.xml
		INJECTED from /home/kura/Stage/Artiphonie-app/android/build/src/release/AndroidManifest.xml
uses-feature#0x00030000
ADDED from /home/kura/Stage/Artiphonie-app/android/build/src/release/AndroidManifest.xml:10:5-78
	android:glEsVersion
		ADDED from /home/kura/Stage/Artiphonie-app/android/build/src/release/AndroidManifest.xml:10:19-51
	android:required
		ADDED from /home/kura/Stage/Artiphonie-app/android/build/src/release/AndroidManifest.xml:10:52-75
uses-permission#android.permission.INTERNET
ADDED from /home/kura/Stage/Artiphonie-app/android/build/src/release/AndroidManifest.xml:11:5-67
	android:name
		ADDED from /home/kura/Stage/Artiphonie-app/android/build/src/release/AndroidManifest.xml:11:22-64
uses-permission#android.permission.READ_EXTERNAL_STORAGE
ADDED from /home/kura/Stage/Artiphonie-app/android/build/src/release/AndroidManifest.xml:12:5-107
	android:maxSdkVersion
		ADDED from /home/kura/Stage/Artiphonie-app/android/build/src/release/AndroidManifest.xml:12:78-104
	android:name
		ADDED from /home/kura/Stage/Artiphonie-app/android/build/src/release/AndroidManifest.xml:12:22-77
uses-permission#android.permission.WRITE_EXTERNAL_STORAGE
ADDED from /home/kura/Stage/Artiphonie-app/android/build/src/release/AndroidManifest.xml:13:5-108
	android:maxSdkVersion
		ADDED from /home/kura/Stage/Artiphonie-app/android/build/src/release/AndroidManifest.xml:13:79-105
	android:name
		ADDED from /home/kura/Stage/Artiphonie-app/android/build/src/release/AndroidManifest.xml:13:22-78
instrumentation
ADDED from /home/kura/Stage/Artiphonie-app/android/build/src/release/AndroidManifest.xml:14:5-19:51
REJECTED from [godot-lib.release.aar] /home/kura/.gradle/caches/transforms-3/116885a8b5e7a96710277a2f2a84ccfd/transformed/jetified-godot-lib.release/AndroidManifest.xml:10:5-14:57
	tools:node
		ADDED from /home/kura/Stage/Artiphonie-app/android/build/src/release/AndroidManifest.xml:15:9-29
	android:label
		ADDED from /home/kura/Stage/Artiphonie-app/android/build/src/release/AndroidManifest.xml:18:9-58
	android:icon
		ADDED from /home/kura/Stage/Artiphonie-app/android/build/src/release/AndroidManifest.xml:17:9-36
	android:targetPackage
		ADDED from /home/kura/Stage/Artiphonie-app/android/build/src/release/AndroidManifest.xml:19:9-48
	android:name
		ADDED from /home/kura/Stage/Artiphonie-app/android/build/src/release/AndroidManifest.xml:16:9-45
meta-data#org.godotengine.plugin.v1.GodotTTS
ADDED from [GodotTTS.1.0.0.release.aar] /home/kura/.gradle/caches/transforms-3/22b5d45566d39cf44dfdeff26ef272b6/transformed/jetified-GodotTTS.1.0.0.release/AndroidManifest.xml:10:9-12:75
	android:value
		ADDED from [GodotTTS.1.0.0.release.aar] /home/kura/.gradle/caches/transforms-3/22b5d45566d39cf44dfdeff26ef272b6/transformed/jetified-GodotTTS.1.0.0.release/AndroidManifest.xml:12:13-72
	android:name
		ADDED from [GodotTTS.1.0.0.release.aar] /home/kura/.gradle/caches/transforms-3/22b5d45566d39cf44dfdeff26ef272b6/transformed/jetified-GodotTTS.1.0.0.release/AndroidManifest.xml:11:13-62
meta-data#org.godotengine.library.version
ADDED from [godot-lib.release.aar] /home/kura/.gradle/caches/transforms-3/116885a8b5e7a96710277a2f2a84ccfd/transformed/jetified-godot-lib.release/AndroidManifest.xml:19:9-21:44
	android:value
		ADDED from [godot-lib.release.aar] /home/kura/.gradle/caches/transforms-3/116885a8b5e7a96710277a2f2a84ccfd/transformed/jetified-godot-lib.release/AndroidManifest.xml:21:13-41
	android:name
		ADDED from [godot-lib.release.aar] /home/kura/.gradle/caches/transforms-3/116885a8b5e7a96710277a2f2a84ccfd/transformed/jetified-godot-lib.release/AndroidManifest.xml:20:13-59
service#org.godotengine.godot.GodotDownloaderService
ADDED from [godot-lib.release.aar] /home/kura/.gradle/caches/transforms-3/116885a8b5e7a96710277a2f2a84ccfd/transformed/jetified-godot-lib.release/AndroidManifest.xml:23:9-80
	android:name
		ADDED from [godot-lib.release.aar] /home/kura/.gradle/caches/transforms-3/116885a8b5e7a96710277a2f2a84ccfd/transformed/jetified-godot-lib.release/AndroidManifest.xml:23:18-77
