{
    "sound" : "gameChoose.ogg",
    "text": "Bienvenue dans la partie jeux. Ici, tu vas voir on va bien rigoler !  Tout d'abord, tu peux faire défiler les pages pour choisir un jeu. Au début, tu n’as pas le choix : tu es obligé de cliquer sur le niveau facile. Plus tu vas devenir fort, plus tu vas débloquer des niveaux difficiles. J’ai hâte de commencer ! On y va ?"
}