[gd_resource type="Theme" load_steps=7 format=3 uid="uid://kyjorlf1kupu"]

[ext_resource type="FontFile" uid="uid://lj7owy53afma" path="res://assets/fonts/DejaVuSans.ttf" id="1"]

[sub_resource type="FontFile" id="5"]
fallbacks = Array[Font]([ExtResource("1")])
face_index = null
embolden = null
transform = null
cache/0/16/0/ascent = 0.0
cache/0/16/0/descent = 0.0
cache/0/16/0/underline_position = 0.0
cache/0/16/0/underline_thickness = 0.0
cache/0/16/0/scale = 1.0
cache/0/16/0/kerning_overrides/16/0 = Vector2(0, 0)

[sub_resource type="StyleBoxFlat" id="1"]
bg_color = Color(0.34902, 0.4, 0.203922, 1)

[sub_resource type="StyleBoxFlat" id="2"]
bg_color = Color(0.34902, 0.4, 0.203922, 1)

[sub_resource type="StyleBoxFlat" id="3"]
bg_color = Color(0.34902, 0.4, 0.203922, 1)

[sub_resource type="StyleBoxFlat" id="4"]
content_margin_left = 15.0
bg_color = Color(0.941176, 0.564706, 0.211765, 1)
border_color = Color(0, 0, 0, 1)
corner_radius_top_left = 10
corner_radius_top_right = 10
corner_radius_bottom_right = 10
corner_radius_bottom_left = 10

[resource]
default_font = SubResource("5")
Button/colors/font_color = Color(0.88, 0.88, 0.88, 1)
Button/colors/font_color_disabled = Color(0.9, 0.9, 0.9, 0.2)
Button/colors/font_color_hover = Color(0.94, 0.94, 0.94, 1)
Button/colors/font_color_pressed = Color(1, 1, 1, 1)
Button/constants/hseparation = 2
Button/fonts/font = SubResource("5")
Button/styles/disabled = null
Button/styles/focus = null
Button/styles/hover = SubResource("1")
Button/styles/normal = SubResource("2")
Button/styles/pressed = SubResource("3")
Label/colors/font_color = Color(0, 0, 0, 1)
Label/colors/font_color_shadow = Color(0, 0, 0, 0)
Label/colors/font_outline_modulate = Color(1, 1, 1, 1)
Label/constants/line_spacing = 3
Label/constants/shadow_as_outline = 0
Label/constants/shadow_offset_x = 1
Label/constants/shadow_offset_y = 1
Label/fonts/font = SubResource("5")
Label/styles/normal = null
LineEdit/colors/clear_button_color = Color(0.88, 0.88, 0.88, 1)
LineEdit/colors/clear_button_color_pressed = Color(1, 1, 1, 1)
LineEdit/colors/cursor_color = Color(0.94, 0.94, 0.94, 1)
LineEdit/colors/font_color = Color(0, 0, 0, 1)
LineEdit/colors/font_color_selected = Color(0, 0, 0, 1)
LineEdit/colors/font_color_uneditable = Color(0.88, 0.88, 0.88, 0.5)
LineEdit/colors/selection_color = Color(0.49, 0.49, 0.49, 1)
LineEdit/constants/minimum_spaces = 12
LineEdit/fonts/font = SubResource("5")
LineEdit/icons/clear = null
LineEdit/styles/focus = null
LineEdit/styles/normal = SubResource("4")
LineEdit/styles/read_only = null
