[gd_scene load_steps=3 format=3 uid="uid://cu15xx0xxnrad"]

[ext_resource type="Script" path="res://shared/back/back_button.gd" id="1"]
[ext_resource type="Theme" uid="uid://cpbbx2ie80qo" path="res://assets/theme/ButtonTheme.tres" id="2"]

[node name="back_button" type="Button"]
anchors_preset = 15
anchor_right = 1.0
anchor_bottom = 1.0
offset_left = 16.0
offset_top = 16.0
offset_right = -1200.0
offset_bottom = -640.0
theme = ExtResource("2")
text = "<"
script = ExtResource("1")

[connection signal="pressed" from="." to="." method="back_button_pressed"]
