[gd_scene load_steps=4 format=3 uid="uid://rf6b3uh67tbv"]

[ext_resource type="Theme" uid="uid://cpbbx2ie80qo" path="res://assets/theme/ButtonTheme.tres" id="1"]
[ext_resource type="Script" path="res://shared/avatarspace/item.gd" id="2"]
[ext_resource type="Texture2D" uid="uid://bbxqnclk5cqlt" path="res://assets/icons/centerStar.png" id="3"]

[node name="item" type="Control"]
layout_mode = 3
anchors_preset = 15
anchor_right = 1.0
anchor_bottom = 1.0
offset_bottom = 6.10352e-05
grow_horizontal = 2
grow_vertical = 2
script = ExtResource("2")

[node name="Button" type="Button" parent="."]
layout_mode = 0
anchor_right = 1.0
anchor_bottom = 1.0
offset_left = 3.5697
offset_top = -0.205997
offset_right = 3.5697
offset_bottom = -0.205994
theme = ExtResource("1")

[node name="Head" type="TextureRect" parent="Button"]
layout_mode = 0
anchor_right = 1.0
anchor_bottom = 0.65
expand_mode = 1
stretch_mode = 6

[node name="ItemImage" type="TextureRect" parent="Button"]
layout_mode = 0
anchor_right = 1.0
anchor_bottom = 0.65
offset_top = -0.139648
offset_bottom = 0.300293
expand_mode = 1
stretch_mode = 6

[node name="Star" type="TextureRect" parent="Button"]
layout_mode = 0
anchor_left = 0.293
anchor_top = 0.7
anchor_right = 0.45
anchor_bottom = 0.9
offset_left = -3.5697
offset_top = 0.205997
texture = ExtResource("3")
expand_mode = 1
stretch_mode = 6

[node name="Required" type="Label" parent="Button"]
layout_mode = 0
anchor_left = 0.45
anchor_top = 0.7
anchor_right = 0.7
anchor_bottom = 0.9

[node name="Equiped" type="Label" parent="Button"]
visible = false
layout_mode = 0
anchor_left = 0.2
anchor_top = 0.7
anchor_right = 0.8
anchor_bottom = 0.9
text = "Equipé !"

[connection signal="pressed" from="Button" to="." method="_on_Button_pressed"]
