,Date,Station,Traitement,Réplicat ,Hauteur,Nb feuilles,Nombre,Nombre rameaux
0,06.2021,1C,NA1,A,125.0,14.0,7,
1,06.2021,1C,NA1,A,180.0,16.0,7,
2,06.2021,1C,NA1,A,80.0,7.0,7,
3,06.2021,1C,NA1,A,75.0,6.0,7,
4,06.2021,1C,NA1,A,145.0,14.0,7,
5,06.2021,1C,NA1,A,170.0,14.0,7,
6,06.2021,1C,NA1,A,135.0,10.0,7,
7,06.2021,1C,NA1,B,,,0,
8,06.2021,1C,NA1,C,,,0,
9,06.2021,1C,NA1+sol,A,140.0,13.0,5,
10,06.2021,1C,NA1+sol,A,135.0,16.0,5,
11,06.2021,1C,NA1+sol,A,145.0,14.0,5,
12,06.2021,1C,NA1+sol,A,160.0,11.0,5,
13,06.2021,1C,NA1+sol,A,130.0,11.0,5,
14,06.2021,1C,NA1+sol,B,,,0,
15,06.2021,1C,NA1+sol,C,,,0,
16,06.2021,1C,NA2,A,,,0,
17,06.2021,1C,NA2,B,,,0,
18,06.2021,1C,NA2,C,,,0,
19,06.2021,1C,NA2+sol,A,,,0,
20,06.2021,1C,NA2+sol,B,,,0,
21,06.2021,1C,NA2+sol,C,,,0,
22,06.2021,1C,Sol,A,120.0,11.0,3,
23,06.2021,1C,Sol,A,65.0,9.0,3,
24,06.2021,1C,Sol,A,60.0,7.0,3,
25,06.2021,1C,Sol,B,,,0,
26,06.2021,1C,Sol,C,130.0,17.0,6,
27,06.2021,1C,Sol,C,100.0,10.0,6,
28,06.2021,1C,Sol,C,90.0,12.0,6,
29,06.2021,1C,Sol,C,130.0,12.0,6,
30,06.2021,1C,Sol,C,185.0,16.0,6,
31,06.2021,1C,Sol,C,180.0,15.0,6,
32,06.2021,1C,Témoin,A,,,0,
33,06.2021,1C,Témoin,B,,,0,
34,06.2021,1C,Témoin,C,200.0,17.0,8,
35,06.2021,1C,Témoin,C,210.0,15.0,8,
36,06.2021,1C,Témoin,C,110.0,7.0,8,
37,06.2021,1C,Témoin,C,215.0,16.0,8,
38,06.2021,1C,Témoin,C,220.0,17.0,8,
39,06.2021,1C,Témoin,C,225.0,18.0,8,
40,06.2021,1C,Témoin,C,200.0,14.0,8,
41,06.2021,1C,Témoin,C,185.0,15.0,8,
42,06.2021,1C,Invasives,A,125.0,16.0,6,
43,06.2021,1C,Invasives,A,40.0,5.0,6,
44,06.2021,1C,Invasives,A,150.0,13.0,6,
45,06.2021,1C,Invasives,A,165.0,17.0,6,
46,06.2021,1C,Invasives,A,170.0,19.0,6,
47,06.2021,1C,Invasives,A,210.0,19.0,6,
48,06.2021,1C,Invasives,B,,,0,
49,06.2021,1C,Invasives,C,,,0,
50,06.2021,2C,NA1,,250.0,,6,
51,06.2021,2C,NA1,,250.0,,6,
52,06.2021,2C,NA1,,240.0,,6,
53,06.2021,2C,NA1,,240.0,,6,
54,06.2021,2C,NA1,,230.0,,6,
55,06.2021,2C,NA1,,220.0,,6,
56,06.2021,2C,NA1+sol,,150.0,,5,
57,06.2021,2C,NA1+sol,,150.0,,5,
58,06.2021,2C,NA1+sol,,150.0,,5,
59,06.2021,2C,NA1+sol,,150.0,,5,
60,06.2021,2C,NA1+sol,,160.0,,5,
61,06.2021,2C,NA2,,210.0,,16,
62,06.2021,2C,NA2,,230.0,,16,
63,06.2021,2C,NA2,,230.0,,16,
64,06.2021,2C,NA2,,240.0,,16,
65,06.2021,2C,NA2,,150.0,,16,
66,06.2021,2C,NA2,,150.0,,16,
67,06.2021,2C,NA2,,150.0,,16,
68,06.2021,2C,NA2,,150.0,,16,
69,06.2021,2C,NA2,,150.0,,16,
70,06.2021,2C,NA2,,110.0,,16,
71,06.2021,2C,NA2,,110.0,,16,
72,06.2021,2C,NA2,,110.0,,16,
73,06.2021,2C,NA2,,110.0,,16,
74,06.2021,2C,NA2,,110.0,,16,
75,06.2021,2C,NA2,,110.0,,16,
76,06.2021,2C,NA2,,120.0,,16,
77,06.2021,2C,NA2+sol,,240.0,,9,
78,06.2021,2C,NA2+sol,,240.0,,9,
79,06.2021,2C,NA2+sol,,240.0,,9,
80,06.2021,2C,NA2+sol,,240.0,,9,
81,06.2021,2C,NA2+sol,,220.0,,9,
82,06.2021,2C,NA2+sol,,220.0,,9,
83,06.2021,2C,NA2+sol,,60.0,,9,
84,06.2021,2C,NA2+sol,,60.0,,9,
85,06.2021,2C,NA2+sol,,80.0,,9,
86,06.2021,2C,Veg locale,,20.0,,1,
87,06.2021,2C,Sol invasive (inversion),,230.0,,28,
88,06.2021,2C,Sol invasive (inversion),,220.0,,28,
89,06.2021,2C,Sol invasive (inversion),,190.0,,28,
90,06.2021,2C,Sol invasive (inversion),,180.0,,28,
91,06.2021,2C,Sol invasive (inversion),,150.0,,28,
92,06.2021,2C,Sol invasive (inversion),,150.0,,28,
93,06.2021,2C,Sol invasive (inversion),,130.0,,28,
94,06.2021,2C,Sol invasive (inversion),,70.0,,28,
95,06.2021,2C,Sol invasive (inversion),,80.0,,28,
96,06.2021,2C,Sol invasive (inversion),,50.0,,28,
97,06.2021,2C,Sol invasive (inversion),,120.0,,28,
98,06.2021,2C,Sol invasive (inversion),,170.0,,28,
99,06.2021,2C,Sol invasive (inversion),,190.0,,28,
100,06.2021,2C,Sol invasive (inversion),,130.0,,28,
101,06.2021,2C,Sol invasive (inversion),,150.0,,28,
102,06.2021,2C,Sol invasive (inversion),,120.0,,28,
103,06.2021,2C,Sol invasive (inversion),,100.0,,28,
104,06.2021,2C,Sol invasive (inversion),,50.0,,28,
105,06.2021,2C,Sol invasive (inversion),,80.0,,28,
106,06.2021,2C,Sol invasive (inversion),,120.0,,28,
107,06.2021,2C,Sol invasive (inversion),,90.0,,28,
108,06.2021,2C,Sol invasive (inversion),,130.0,,28,
109,06.2021,2C,Sol invasive (inversion),,130.0,,28,
110,06.2021,2C,Sol invasive (inversion),,110.0,,28,
111,06.2021,2C,Sol invasive (inversion),,120.0,,28,
112,06.2021,2C,Sol invasive (inversion),,140.0,,28,
113,06.2021,2C,Sol invasive (inversion),,90.0,,28,
114,06.2021,2C,Sol invasive (inversion),,130.0,,28,
115, 04.11.202+117:1541,1C,NA1,A,150.0,20.0,8,
116, 04.11.2021,1C,NA1,A,160.0,18.0,8,
117, 04.11.2021,1C,NA1,A,100.0,12.0,8,
118, 04.11.2021,1C,NA1,A,290.0,29.0,8,
119, 04.11.2021,1C,NA1,A,110.0,13.0,8,
120, 04.11.2021,1C,NA1,A,360.0,32.0,8,
121, 04.11.2021,1C,NA1,A,370.0,32.0,8,
122, 04.11.2021,1C,NA1,A,290.0,31.0,8,
123, 04.11.2021,1C,NA1,B,100.0,17.0,1,
124, 04.11.2021,1C,NA1,C,110.0,16.0,3,
125, 04.11.2021,1C,NA1,C,126.0,22.0,3,
126, 04.11.2021,1C,NA1,C,138.0,12.0,3,
127, 04.11.2021,1C,NA1+sol,A,,,0,
128, 04.11.2021,1C,NA1+sol,B,,,0,
129, 04.11.2021,1C,NA1+sol,C,,,0,
130, 04.11.2021,1C,NA2,A,,,0,
131, 04.11.2021,1C,NA2,B,,,0,
132, 04.11.2021,1C,NA2,C,,,0,
133, 04.11.2021,1C,NA2+sol,A,160.0,23.0,1,
134, 04.11.2021,1C,NA2+sol,B,60.0,14.0,1,
135, 04.11.2021,1C,NA2+sol,C,,,0,
136, 04.11.2021,1C,sol,A,250.0,26.0,8,
137, 04.11.2021,1C,sol,A,55.0,5.0,8,
138, 04.11.2021,1C,sol,A,45.0,11.0,8,
139, 04.11.2021,1C,sol,A,54.0,13.0,8,
140, 04.11.2021,1C,sol,A,134.0,21.0,8,
141, 04.11.2021,1C,sol,A,204.0,22.0,8,
142, 04.11.2021,1C,sol,A,220.0,26.0,8,
143, 04.11.2021,1C,sol,A,238.0,27.0,8,
144, 04.11.2021,1C,sol,B,,,0,
145, 04.11.2021,1C,sol,C,270.0,34.0,9,
146, 04.11.2021,1C,sol,C,86.0,12.0,9,
147, 04.11.2021,1C,sol,C,206.0,30.0,9,
148, 04.11.2021,1C,sol,C,380.0,42.0,9,
149, 04.11.2021,1C,sol,C,360.0,30.0,9,
150, 04.11.2021,1C,sol,C,190.0,15.0,9,
151, 04.11.2021,1C,sol,C,40.0,2.0,9,
152, 04.11.2021,1C,sol,C,310.0,34.0,9,
153, 04.11.2021,1C,sol,C,320.0,36.0,9,
154, 04.11.2021,1C,Témoin,A,300.0,18.0,2,
155, 04.11.2021,1C,Témoin,A,200.0,22.0,2,
156, 04.11.2021,1C,Témoin,B,144.0,13.0,4,
157, 04.11.2021,1C,Témoin,B,114.0,12.0,4,
158, 04.11.2021,1C,Témoin,B,200.0,18.0,4,
159, 04.11.2021,1C,Témoin,B,204.0,19.0,4,
160, 04.11.2021,1C,Témoin,C,365.0,28.0,14,
161, 04.11.2021,1C,Témoin,C,408.0,38.0,14,
162, 04.11.2021,1C,Témoin,C,386.0,37.0,14,
163, 04.11.2021,1C,Témoin,C,292.0,21.0,14,
164, 04.11.2021,1C,Témoin,C,356.0,28.0,14,
165, 04.11.2021,1C,Témoin,C,330.0,26.0,14,
166, 04.11.2021,1C,Témoin,C,420.0,38.0,14,
167, 04.11.2021,1C,Témoin,C,440.0,44.0,14,
168, 04.11.2021,1C,Témoin,C,380.0,26.0,14,
169, 04.11.2021,1C,Témoin,C,430.0,34.0,14,
170, 04.11.2021,1C,Témoin,C,366.0,34.0,14,
171, 04.11.2021,1C,Témoin,C,414.0,44.0,14,
172, 04.11.2021,1C,Témoin,C,415.0,46.0,14,
173, 04.11.2021,1C,Témoin,C,390.0,38.0,14,
174, 04.11.2021,1C,Invasives,A,,,0,
175, 04.11.2021,1C,Invasives,B,,,0,
176, 04.11.2021,1C,Invasives,C,160.0,18.0,10,
177, 04.11.2021,1C,Invasives,C,304.0,36.0,10,
178, 04.11.2021,1C,Invasives,C,184.0,18.0,10,
179, 04.11.2021,1C,Invasives,C,312.0,32.0,10,
180, 04.11.2021,1C,Invasives,C,322.0,34.0,10,
181, 04.11.2021,1C,Invasives,C,380.0,32.0,10,
182, 04.11.2021,1C,Invasives,C,294.0,34.0,10,
183, 04.11.2021,1C,Invasives,C,440.0,46.0,10,
184, 04.11.2021,1C,Invasives,C,320.0,32.0,10,
185, 04.11.2021,1C,Invasives,C,385.0,40.0,10,
186, 04.11.2021,2C,NA1,A,,,0,
187, 04.11.2021,2C,NA1,B,160.0,6.0,5,
188, 04.11.2021,2C,NA1,B,93.0,9.0,5,
189, 04.11.2021,2C,NA1,B,275.0,21.0,5,
190, 04.11.2021,2C,NA1,B,342.0,25.0,5,
191, 04.11.2021,2C,NA1,B,84.0,11.0,5,
192, 04.11.2021,2C,NA1,C,,,0,
193, 04.11.2021,2C,NA1+sol,A,,,0,
194, 04.11.2021,2C,NA1+sol,B,,,0,
195, 04.11.2021,2C,NA1+sol,C,,,0,
196, 04.11.2021,2C,NA2,A,,,0,
197, 04.11.2021,2C,NA2,B,370.0,32.0,11,
198, 04.11.2021,2C,NA2,B,309.0,27.0,11,
199, 04.11.2021,2C,NA2,B,241.0,19.0,11,
200, 04.11.2021,2C,NA2,B,215.0,17.0,11,
201, 04.11.2021,2C,NA2,B,183.0,18.0,11,
202, 04.11.2021,2C,NA2,B,200.0,17.0,11,
203, 04.11.2021,2C,NA2,B,187.0,16.0,11,
204, 04.11.2021,2C,NA2,B,147.0,17.0,11,
205, 04.11.2021,2C,NA2,B,171.0,16.0,11,
206, 04.11.2021,2C,NA2,B,98.0,3.0,11,
207, 04.11.2021,2C,NA2,B,215.0,21.0,11,
208, 04.11.2021,2C,NA2,C,249.0,19.0,3,
209, 04.11.2021,2C,NA2,C,220.0,15.0,3,
210, 04.11.2021,2C,NA2,C,299.0,25.0,3,
211, 04.11.2021,2C,NA2+sol,A,377.0,42.0,3,
212, 04.11.2021,2C,NA2+sol,A,385.0,42.0,3,
213, 04.11.2021,2C,NA2+sol,A,363.0,43.0,3,
214, 04.11.2021,2C,NA2+sol,B,389.0,32.0,3,
215, 04.11.2021,2C,NA2+sol,B,400.0,34.0,3,
216, 04.11.2021,2C,NA2+sol,B,358.0,46.0,3,
217, 04.11.2021,2C,NA2+sol,C,303.0,38.0,1,
218, 04.11.2021,2C,sol,A,,,0,
219, 04.11.2021,2C,sol,B,42.0,41.0,7,
220, 04.11.2021,2C,sol,B,33.0,39.0,7,
221, 04.11.2021,2C,sol,B,34.0,44.0,7,
222, 04.11.2021,2C,sol,B,25.0,28.0,7,
223, 04.11.2021,2C,sol,B,245.0,27.0,7,
224, 04.11.2021,2C,sol,B,236.0,28.0,7,
225, 04.11.2021,2C,sol,B,210.0,25.0,7,
226, 04.11.2021,2C,sol,C,230.0,30.0,14,
227, 04.11.2021,2C,sol,C,97.0,12.0,14,
228, 04.11.2021,2C,sol,C,125.0,17.0,14,
229, 04.11.2021,2C,sol,C,102.0,10.0,14,
230, 04.11.2021,2C,sol,C,86.0,3.0,14,
231, 04.11.2021,2C,sol,C,126.0,11.0,14,
232, 04.11.2021,2C,sol,C,175.0,23.0,14,
233, 04.11.2021,2C,sol,C,280.0,27.0,14,
234, 04.11.2021,2C,sol,C,312.0,27.0,14,
235, 04.11.2021,2C,sol,C,227.0,19.0,14,
236, 04.11.2021,2C,sol,C,177.0,22.0,14,
237, 04.11.2021,2C,sol,C,257.0,33.0,14,
238, 04.11.2021,2C,sol,C,134.0,12.0,14,
239, 04.11.2021,2C,sol,C,60.0,8.0,14,
240, 04.11.2021,2C,Témoin,A,,,0,
241, 04.11.2021,2C,Témoin,B,,,0,
242, 04.11.2021,2C,Témoin,C,,,0,
243, 04.11.2021,2C,Invasives,A,,,0,
244, 04.11.2021,2C,Invasives,B,,,0,
245, 04.11.2021,2C,Invasives,C,,,0,
246,23.05.2022,1C,NA1,A,400.0,70.0,6,
247,23.05.2022,1C,NA1,A,400.0,92.0,6,
248,23.05.2022,1C,NA1,A,350.0,32.0,6,
249,23.05.2022,1C,NA1,A,250.0,38.0,6,
250,23.05.2022,1C,NA1,A,370.0,78.0,6,
251,23.05.2022,1C,NA1,A,102.0,28.0,6,
252,23.05.2022,1C,NA1,B,,,0,
253,23.05.2022,1C,NA1,C,84.0,12.0,3,
254,23.05.2022,1C,NA1,C,100.0,14.0,3,
255,23.05.2022,1C,NA1,C,140.0,14.0,3,
256,23.05.2022,1C,NA1+sol,A,0.0,0.0,0,
257,23.05.2022,1C,NA1+sol,B,0.0,0.0,0,
258,23.05.2022,1C,NA1+sol,C,0.0,0.0,0,
259,23.05.2022,1C,NA2,A,0.0,0.0,0,
260,23.05.2022,1C,NA2,B,0.0,0.0,0,
261,23.05.2022,1C,NA2,C,0.0,0.0,0,
262,23.05.2022,1C,NA2+sol,A,0.0,0.0,0,
263,23.05.2022,1C,NA2+sol,B,0.0,0.0,0,
264,23.05.2022,1C,NA2+sol,C,0.0,0.0,0,
265,23.05.2022,1C,sol,A,184.0,38.0,6,
266,23.05.2022,1C,sol,A,98.0,12.0,6,
267,23.05.2022,1C,sol,A,113.0,20.0,6,
268,23.05.2022,1C,sol,A,28.0,7.0,6,
269,23.05.2022,1C,sol,A,33.0,8.0,6,
270,23.05.2022,1C,sol,A,220.0,42.0,6,
271,23.05.2022,1C,sol,B,146.0,15.0,2,
272,23.05.2022,1C,sol,B,118.0,14.0,2,
273,23.05.2022,1C,sol,C,390.0,104.0,8,
274,23.05.2022,1C,sol,C,104.0,10.0,8,
275,23.05.2022,1C,sol,C,130.0,12.0,8,
276,23.05.2022,1C,sol,C,330.0,78.0,8,
277,23.05.2022,1C,sol,C,230.0,28.0,8,
278,23.05.2022,1C,sol,C,120.0,12.0,8,
279,23.05.2022,1C,sol,C,200.0,16.0,8,
280,23.05.2022,1C,sol,C,450.0,108.0,8,
281,23.05.2022,1C,Témoin,A,200.0,36.0,1,
282,23.05.2022,1C,Témoin,B,110.0,44.0,7,
283,23.05.2022,1C,Témoin,B,89.0,23.0,7,
284,23.05.2022,1C,Témoin,B,168.0,19.0,7,
285,23.05.2022,1C,Témoin,B,200.0,43.0,7,
286,23.05.2022,1C,Témoin,B,210.0,41.0,7,
287,23.05.2022,1C,Témoin,B,125.0,26.0,7,
288,23.05.2022,1C,Témoin,B,112.0,18.0,7,
289,23.05.2022,1C,Témoin,C,300.0,10.0,12,
290,23.05.2022,1C,Témoin,C,340.0,78.0,12,
291,23.05.2022,1C,Témoin,C,90.0,8.0,12,
292,23.05.2022,1C,Témoin,C,320.0,65.0,12,
293,23.05.2022,1C,Témoin,C,450.0,72.0,12,
294,23.05.2022,1C,Témoin,C,320.0,96.0,12,
295,23.05.2022,1C,Témoin,C,470.0,72.0,12,
296,23.05.2022,1C,Témoin,C,380.0,55.0,12,
297,23.05.2022,1C,Témoin,C,450.0,84.0,12,
298,23.05.2022,1C,Témoin,C,400.0,60.0,12,
299,23.05.2022,1C,Témoin,C,450.0,57.0,12,
300,23.05.2022,1C,Témoin,C,40.0,108.0,12,
301,23.05.2022,1C,Invasives,A,235.0,40.0,4,
302,23.05.2022,1C,Invasives,A,245.0,50.0,4,
303,23.05.2022,1C,Invasives,A,470.0,86.0,4,
304,23.05.2022,1C,Invasives,A,235.0,32.0,4,
305,23.05.2022,1C,Invasives,B,,,0,
306,23.05.2022,1C,Invasives,C,,,0,
307,23.05.2022,2C,NA1,A,,,0,
308,23.05.2022,2C,NA1,B,250.0,73.0,2,
309,23.05.2022,2C,NA1,B,150.0,14.0,2,
310,23.05.2022,2C,NA1,C,470.0,126.0,1,
311,23.05.2022,2C,NA1+sol,A,,,0,
312,23.05.2022,2C,NA1+sol,B,,,0,
313,23.05.2022,2C,NA1+sol,C,,,0,
314,23.05.2022,2C,NA2,A,60.0,6.0,1,
315,23.05.2022,2C,NA2,B,90.0,6.0,1,
316,23.05.2022,2C,NA2,C,240.0,72.0,1,
317,23.05.2022,2C,NA2+sol,A,450.0,140.0,7,
318,23.05.2022,2C,NA2+sol,A,450.0,120.0,7,
319,23.05.2022,2C,NA2+sol,A,94.0,10.0,7,
320,23.05.2022,2C,NA2+sol,A,450.0,162.0,7,
321,23.05.2022,2C,NA2+sol,A,450.0,152.0,7,
322,23.05.2022,2C,NA2+sol,A,100.0,8.0,7,
323,23.05.2022,2C,NA2+sol,A,445.0,136.0,7,
324,23.05.2022,2C,NA2+sol,B,450.0,120.0,5,
325,23.05.2022,2C,NA2+sol,B,130.0,42.0,`5,
326,23.05.2022,2C,NA2+sol,B,450.0,280.0,5,
327,23.05.2022,2C,NA2+sol,B,63.0,6.0,5,
328,23.05.2022,2C,NA2+sol,B,460.0,138.0,5,
329,23.05.2022,2C,NA2+sol,C,100.0,8.0,2,
330,23.05.2022,2C,NA2+sol,C,130.0,12.0,2,
331,23.05.2022,2C,Sol,A,50.0,5.0,1,
332,23.05.2022,2C,Sol,B,420.0,138.0,9,
333,23.05.2022,2C,Sol,B,320.0,78.0,9,
334,23.05.2022,2C,Sol,B,330.0,98.0,9,
335,23.05.2022,2C,Sol,B,220.0,32.0,9,
336,23.05.2022,2C,Sol,B,220.0,20.0,9,
337,23.05.2022,2C,Sol,B,210.0,22.0,9,
338,23.05.2022,2C,Sol,B,200.0,12.0,9,
339,23.05.2022,2C,Sol,B,210.0,14.0,9,
340,23.05.2022,2C,Sol,B,200.0,20.0,9,
341,23.05.2022,2C,Sol,C,136.0,26.0,12,
342,23.05.2022,2C,Sol,C,220.0,66.0,12,
343,23.05.2022,2C,Sol,C,250.0,52.0,12,
344,23.05.2022,2C,Sol,C,200.0,48.0,12,
345,23.05.2022,2C,Sol,C,210.0,36.0,12,
346,23.05.2022,2C,Sol,C,310.0,78.0,12,
347,23.05.2022,2C,Sol,C,210.0,18.0,12,
348,23.05.2022,2C,Sol,C,50.0,8.0,12,
349,23.05.2022,2C,Sol,C,140.0,14.0,12,
350,23.05.2022,2C,Sol,C,120.0,8.0,12,
351,23.05.2022,2C,Sol,C,250.0,73.0,12,
352,23.05.2022,2C,Témoin,A,,,0,
353,23.05.2022,2C,Témoin,B,,,0,
354,23.05.2022,2C,Témoin,C,39.0,11.0,3,
355,23.05.2022,2C,Témoin,C,63.0,14.0,3,
356,23.05.2022,2C,Témoin,C,52.0,6.0,3,
357,23.05.2022,2C,Invasives,A,,,0,
358,23.05.2022,2C,Invasives,B,180.0,16.0,3,
359,23.05.2022,2C,Invasives,B,120.0,10.0,3,
360,23.05.2022,2C,Invasives,B,178.0,14.0,3,
361,23.05.2022,2C,Invasives,C,,,0,
