Date,Station,Traitement,Réplicat,Hauteur,Nb feuilles,Nombre,Nombre rameaux
06.2021,3A,NA1,A,40.0,26.0,1,
06.2021,3A,NA1,B,,,0,
06.2021,3A,NA1,C,40.0,64.0,1,
06.2021,3A,NA1+sol,A,,,0,
06.2021,3A,NA1+sol,B,60.0,100.0,2,
06.2021,3A,NA1+sol,B,35.0,20.0,2,
06.2021,3A,NA1+sol,C,50.0,84.0,1,
06.2021,3A,NA2,A,,,0,
06.2021,3A,NA2,B,20.0,32.0,2,
06.2021,3A,NA2,B,25.0,46.0,2,
06.2021,3A,NA2,C,,,0,
06.2021,3A,NA2+sol,A,15.0,28.0,1,
06.2021,3A,NA2+sol,B,50.0,66.0,2,
06.2021,3A,NA2+sol,B,35.0,48.0,2,
06.2021,3A,NA2+sol,C,,,0,
06.2021,3A,Sol,A,60.0,192.0,5,
06.2021,3A,Sol,A,20.0,36.0,5,
06.2021,3A,Sol,A,10.0,28.0,5,
06.2021,3A,Sol,A,20.0,18.0,5,
06.2021,3A,Sol,A,20.0,66.0,5,
06.2021,3A,Sol,B,15.0,66.0,2,
06.2021,3A,Sol,B,40.0,122.0,2,
06.2021,3A,Sol,C,50.0,340.0,7,
06.2021,3A,Sol,C,20.0,130.0,7,
06.2021,3A,Sol,C,35.0,240.0,7,
06.2021,3A,Sol,C,30.0,120.0,7,
06.2021,3A,Sol,C,20.0,80.0,7,
06.2021,3A,Sol,C,60.0,280.0,7,
06.2021,3A,Sol,C,45.0,190.0,7,
06.2021,3A,Témoin,A,40.0,38.0,6,
06.2021,3A,Témoin,A,40.0,56.0,6,
06.2021,3A,Témoin,A,70.0,64.0,6,
06.2021,3A,Témoin,A,30.0,34.0,6,
06.2021,3A,Témoin,A,15.0,28.0,6,
06.2021,3A,Témoin,A,10.0,22.0,6,
06.2021,3A,Témoin,B,,,0,
06.2021,3A,Témoin,C,55.0,90.0,6,
06.2021,3A,Témoin,C,20.0,56.0,6,
06.2021,3A,Témoin,C,65.0,186.0,6,
06.2021,3A,Témoin,C,50.0,122.0,6,
06.2021,3A,Témoin,C,20.0,66.0,6,
06.2021,3A,Témoin,C,50.0,166.0,6,
06.2021,3A,Invasives,A,40.0,92.0,5,
06.2021,3A,Invasives,A,35.0,96.0,5,
06.2021,3A,Invasives,A,25.0,48.0,5,
06.2021,3A,Invasives,A,20.0,66.0,5,
06.2021,3A,Invasives,A,35.0,106.0,5,
06.2021,3A,Invasives,B,15.0,36.0,3,
06.2021,3A,Invasives,B,20.0,42.0,3,
06.2021,3A,Invasives,B,10.0,30.0,3,
06.2021,3A,Invasives,C,30.0,120.0,7,
06.2021,3A,Invasives,C,10.0,54.0,7,
06.2021,3A,Invasives,C,10.0,48.0,7,
06.2021,3A,Invasives,C,50.0,228.0,7,
06.2021,3A,Invasives,C,60.0,342.0,7,
06.2021,3A,Invasives,C,70.0,620.0,7,
06.2021,3A,Invasives,C,25.0,44.0,7,
03.11.2021,3A,NA1,A,,,8,
03.11.2021,3A,NA1,B,,,0,
03.11.2021,3A,NA1,C,,,2,
03.11.2021,3A,NA1+sol,A,,,2,
03.11.2021,3A,NA1+sol,B,,,6,
03.11.2021,3A,NA1+sol,C,,,4,
03.11.2021,3A,NA2,A,,,0,
03.11.2021,3A,NA2,B,,,2,
03.11.2021,3A,NA2,C,,,1,
03.11.2021,3A,NA2+sol,A,,,2,
03.11.2021,3A,NA2+sol,B,,,3,
03.11.2021,3A,NA2+sol,C,,,1,
03.11.2021,3A,sol,A,,,8,
03.11.2021,3A,sol,B,,,1,
03.11.2021,3A,sol,C,,,24,
03.11.2021,3A,Témoin,A,,,6,
03.11.2021,3A,Témoin,B,,,3,
03.11.2021,3A,Témoin,C,,,12,
03.11.2021,3A,Invasives,A,,,16,
03.11.2021,3A,Invasives,B,,,2,
03.11.2021,3A,Invasives,C,,,35,
23.05.2022,3A,NA1,A,84.0,6.0,2,
23.05.2022,3A,NA1,A,60.0,7.0,2,
23.05.2022,3A,NA1,B,,,0,
23.05.2022,3A,NA1,C,160.0,10.0,4,
23.05.2022,3A,NA1,C,170.0,11.0,4,
23.05.2022,3A,NA1,C,150.0,10.0,4,
23.05.2022,3A,NA1,C,140.0,10.0,4,
23.05.2022,3A,NA1+sol,A,200.0,22.0,6,
23.05.2022,3A,NA1+sol,A,170.0,12.0,6,
23.05.2022,3A,NA1+sol,A,84.0,8.0,6,
23.05.2022,3A,NA1+sol,A,160.0,14.0,6,
23.05.2022,3A,NA1+sol,A,148.0,18.0,6,
23.05.2022,3A,NA1+sol,A,166.0,16.0,6,
23.05.2022,3A,NA1+sol,B,102.0,10.0,1,
23.05.2022,3A,NA1+sol,C,150.0,15.0,4,
23.05.2022,3A,NA1+sol,C,125.0,8.0,4,
23.05.2022,3A,NA1+sol,C,110.0,11.0,4,
23.05.2022,3A,NA1+sol,C,140.0,14.0,4,
23.05.2022,3A,NA2,A,40.0,6.0,3,
23.05.2022,3A,NA2,A,60.0,8.0,3,
23.05.2022,3A,NA2,A,120.0,12.0,3,
23.05.2022,3A,NA2,B,75.0,8.0,4,
23.05.2022,3A,NA2,B,82.0,10.0,4,
23.05.2022,3A,NA2,B,90.0,10.0,4,
23.05.2022,3A,NA2,B,76.0,8.0,4,
23.05.2022,3A,NA2,C,35.0,4.0,1,
23.05.2022,3A,NA2+sol,A,114.0,8.0,6,
23.05.2022,3A,NA2+sol,A,112.0,6.0,6,
23.05.2022,3A,NA2+sol,A,70.0,6.0,6,
23.05.2022,3A,NA2+sol,A,83.0,12.0,6,
23.05.2022,3A,NA2+sol,A,156.0,16.0,6,
23.05.2022,3A,NA2+sol,A,154.0,12.0,6,
23.05.2022,3A,NA2+sol,B,160.0,12.0,1,
23.05.2022,3A,NA2+sol,C,155.0,13.0,3,
23.05.2022,3A,NA2+sol,C,140.0,10.0,3,
23.05.2022,3A,NA2+sol,C,130.0,10.0,3,
23.05.2022,3A,Sol,A,230.0,34.0,12,
23.05.2022,3A,Sol,A,160.0,14.0,12,
23.05.2022,3A,Sol,A,180.0,12.0,12,
23.05.2022,3A,Sol,A,178.0,14.0,12,
23.05.2022,3A,Sol,A,190.0,12.0,12,
23.05.2022,3A,Sol,A,180.0,32.0,12,
23.05.2022,3A,Sol,A,200.0,16.0,12,
23.05.2022,3A,Sol,A,150.0,10.0,12,
23.05.2022,3A,Sol,A,120.0,8.0,12,
23.05.2022,3A,Sol,A,150.0,12.0,12,
23.05.2022,3A,Sol,A,80.0,8.0,12,
23.05.2022,3A,Sol,A,104.0,8.0,12,
23.05.2022,3A,Sol,B,104.0,10.0,6,
23.05.2022,3A,Sol,B,80.0,6.0,6,
23.05.2022,3A,Sol,B,70.0,6.0,6,
23.05.2022,3A,Sol,B,146.0,10.0,6,
23.05.2022,3A,Sol,B,115.0,20.0,6,
23.05.2022,3A,Sol,B,62.0,18.0,6,
23.05.2022,3A,Sol,C,142.0,13.0,5,
23.05.2022,3A,Sol,C,160.0,15.0,5,
23.05.2022,3A,Sol,C,173.0,12.0,5,
23.05.2022,3A,Sol,C,90.0,8.0,5,
23.05.2022,3A,Sol,C,62.0,4.0,5,
23.05.2022,3A,Témoin,A,4.0,16.0,8,
23.05.2022,3A,Témoin,A,230.0,17.0,8,
23.05.2022,3A,Témoin,A,190.0,11.0,8,
23.05.2022,3A,Témoin,A,180.0,13.0,8,
23.05.2022,3A,Témoin,A,160.0,17.0,8,
23.05.2022,3A,Témoin,A,140.0,8.0,8,
23.05.2022,3A,Témoin,A,110.0,8.0,8,
23.05.2022,3A,Témoin,A,150.0,10.0,8,
23.05.2022,3A,Témoin,B,220.0,15.0,2,
23.05.2022,3A,Témoin,B,100.0,7.0,2,
23.05.2022,3A,Témoin,C,150.0,10.0,6,
23.05.2022,3A,Témoin,C,90.0,7.0,6,
23.05.2022,3A,Témoin,C,205.0,16.0,6,
23.05.2022,3A,Témoin,C,215.0,18.0,6,
23.05.2022,3A,Témoin,C,130.0,9.0,6,
23.05.2022,3A,Témoin,C,70.0,10.0,6,
23.05.2022,3A,Invasives,A,300.0,17.0,10,
23.05.2022,3A,Invasives,A,280.0,18.0,10,
23.05.2022,3A,Invasives,A,230.0,23.0,10,
23.05.2022,3A,Invasives,A,200.0,17.0,10,
23.05.2022,3A,Invasives,A,210.0,18.0,10,
23.05.2022,3A,Invasives,A,170.0,19.0,10,
23.05.2022,3A,Invasives,A,300.0,21.0,10,
23.05.2022,3A,Invasives,A,120.0,7.0,10,
23.05.2022,3A,Invasives,A,160.0,8.0,10,
23.05.2022,3A,Invasives,A,200.0,14.0,10,
23.05.2022,3A,Invasives,B,163.0,19.0,4,
23.05.2022,3A,Invasives,B,114.0,16.0,4,
23.05.2022,3A,Invasives,B,118.0,14.0,4,
23.05.2022,3A,Invasives,B,77.0,6.0,4,
23.05.2022,3A,Invasives,C,160.0,18.0,9,
23.05.2022,3A,Invasives,C,250.0,22.0,9,
23.05.2022,3A,Invasives,C,140.0,24.0,9,
23.05.2022,3A,Invasives,C,170.0,16.0,9,
23.05.2022,3A,Invasives,C,108.0,12.0,9,
23.05.2022,3A,Invasives,C,220.0,26.0,9,
23.05.2022,3A,Invasives,C,190.0,16.0,9,
23.05.2022,3A,Invasives,C,50.0,6.0,9,
23.05.2022,3A,Invasives,C,46.0,6.0,9,
