Station,NA1,NA2,Sol,témoin,invasive,hauteur,nombre feuilles,date,nombre
1M,1,0,0,0,0,15.58333333,48.58333333,06.2021,12
1M,1,0,0,0,0,16.44444444,42.55555556,06.2021,9
1M,1,0,0,0,0,15.0,38.57142857,06.2021,7
1M,1,0,1,0,0,21.875,112.5,06.2021,4
1M,1,0,1,0,0,,,06.2021,0
1M,1,0,1,0,0,,,06.2021,0
1M,0,1,0,0,0,28.1,300.75,06.2021,4
1M,0,1,0,0,0,33.33333333,125.3333333,06.2021,6
1M,0,1,0,0,0,47.0,195.0,06.2021,2
1M,0,1,1,0,0,24.0,62.75,06.2021,4
1M,0,1,1,0,0,28.33333333,91.66666667,06.2021,3
1M,0,1,1,0,0,,,06.2021,0
1M,0,0,1,0,0,,,06.2021,0
1M,0,0,1,0,0,,,06.2021,0
1M,0,0,1,0,0,36.66666667,286.6666667,06.2021,3
1M,0,0,0,1,0,5.5,3.0,06.2021,1
1M,0,0,0,1,0,13.625,34.0,06.2021,4
1M,0,0,0,1,0,28.5,130.0,06.2021,2
1M,0,0,0,0,0,,,06.2021,2
1M,0,0,0,0,0,,,06.2021,3
1M,0,0,0,0,0,,,06.2021,8
1M,1,0,0,0,0,51.08333333,14.20833333,04.11.2021,24
1M,1,0,0,0,0,52.66666667,10.25,04.11.2021,12
1M,1,0,0,0,0,77.33333333,18.0,04.11.2021,9
1M,1,0,1,0,0,56.0,11.0,04.11.2021,2
1M,1,0,1,0,0,28.0,5.0,04.11.2021,1
1M,1,0,1,0,0,54.85714286,10.85714286,04.11.2021,7
1M,0,1,0,0,0,57.66666667,44.66666667,04.11.2021,6
1M,0,1,0,0,0,51.57894737,14.26315789,04.11.2021,20
1M,0,1,0,0,0,130.0,67.0,04.11.2021,2
1M,0,1,1,0,0,69.33333333,40.33333333,04.11.2021,3
1M,0,1,1,0,0,66.66666667,35.33333333,04.11.2021,3
1M,0,1,1,0,0,58.0,18.5,04.11.2021,2
1M,0,0,1,0,0,24.0,10.0,04.11.2021,1
1M,0,0,1,0,0,40.90909091,15.18181818,04.11.2021,11
1M,0,0,1,0,0,76.66666667,32.5,04.11.2021,6
1M,0,0,0,1,0,44.0,43.33333333,04.11.2021,3
1M,0,0,0,1,0,49.0,36.5,04.11.2021,2
1M,0,0,0,1,0,58.0,33.33333333,04.11.2021,6
1M,0,0,0,0,0,,,04.11.2021,3
1M,0,0,0,0,0,,,04.11.2021,3
1M,0,0,0,0,0,,,04.11.2021,8
1M,1,0,0,0,0,94.53846153846152,29.46153846153846,24.05.2022,13
1M,1,0,0,0,0,82.92307692307692,25.923076923076923,24.05.2022,13
1M,1,0,0,0,0,114.25,46.5,24.05.2022,4
1M,1,0,1,0,0,120.0,34.0,24.05.2022,1
1M,1,0,1,0,0,,,24.05.2022,0
1M,1,0,1,0,0,163.0,76.0,24.05.2022,1
1M,0,1,0,0,0,117.66666666666669,61.0,24.05.2022,6
1M,0,1,0,0,0,68.4,32.0,24.05.2022,5
1M,0,1,0,0,0,158.5,103.5,24.05.2022,2
1M,0,1,1,0,0,98.0,61.0,24.05.2022,4
1M,0,1,1,0,0,48.0,26.8,24.05.2022,5
1M,0,1,1,0,0,122.0,87.0,24.05.2022,4
1M,0,0,1,0,0,54.5,34.0,24.05.2022,4
1M,0,0,1,0,0,78.25,33.0,24.05.2022,8
1M,0,0,1,0,0,87.18181818181819,34.27272727272727,24.05.2022,11
1M,0,0,0,1,0,79.0,21.4,24.05.2022,5
1M,0,0,0,1,0,101.33333333333331,46.0,24.05.2022,3
1M,0,0,0,1,0,153.33333333333334,101.0,24.05.2022,6
1M,0,0,0,0,0,430.0,26.0,24.05.2022,3
1M,0,0,0,0,0,178.5,47.25,24.05.2022,4
1M,0,0,0,0,0,227.11111111111111,96.55555555555556,24.05.2022,10
1C,1,0,0,0,0,,,06.2021,7
1C,1,0,0,0,0,,,06.2021,0
1C,1,0,0,0,0,,,06.2021,0
1C,1,0,1,0,0,142.0,13.0,06.2021,5
1C,1,0,1,0,0,,,06.2021,0
1C,1,0,1,0,0,,,06.2021,0
1C,0,1,0,0,0,,,06.2021,0
1C,0,1,0,0,0,,,06.2021,0
1C,0,1,0,0,0,,,06.2021,0
1C,0,1,1,0,0,,,06.2021,0
1C,0,1,1,0,0,,,06.2021,0
1C,0,1,1,0,0,,,06.2021,0
1C,0,0,1,0,0,81.66666666666667,9.0,06.2021,3
1C,0,0,1,0,0,,,06.2021,0
1C,0,0,1,0,0,135.83333333333334,13.666666666666666,06.2021,6
1C,0,0,0,1,0,,,06.2021,0
1C,0,0,0,1,0,,,06.2021,0
1C,0,0,0,1,0,195.625,14.875,06.2021,8
1C,0,0,0,0,0,143.33333333333334,14.833333333333334,06.2021,6
1C,0,0,0,0,0,,,06.2021,0
1C,0,0,0,0,0,,,06.2021,0
1C,1,0,0,0,0,228.75,23.375,04.11.2021,8
1C,1,0,0,0,0,100.0,17.0,04.11.2021,1
1C,1,0,0,0,0,124.66666666666669,16.666666666666668,04.11.2021,3
1C,1,0,1,0,0,,,04.11.2021,0
1C,1,0,1,0,0,,,04.11.2021,0
1C,1,0,1,0,0,,,04.11.2021,0
1C,0,1,0,0,0,,,04.11.2021,0
1C,0,1,0,0,0,,,04.11.2021,0
1C,0,1,0,0,0,,,04.11.2021,0
1C,0,1,1,0,0,160.0,23.0,04.11.2021,1
1C,0,1,1,0,0,60.0,14.0,04.11.2021,1
1C,0,1,1,0,0,,,04.11.2021,0
1C,0,0,1,0,0,150.0,18.875,04.11.2021,8
1C,0,0,1,0,0,,,04.11.2021,0
1C,0,0,1,0,0,240.22222222222223,26.11111111111111,04.11.2021,9
1C,0,0,0,1,0,250.0,20.0,04.11.2021,2
1C,0,0,0,1,0,165.5,15.5,04.11.2021,4
1C,0,0,0,1,0,385.1428571428572,34.42857142857143,04.11.2021,14
1C,0,0,0,0,0,,,04.11.2021,0
1C,0,0,0,0,0,,,04.11.2021,0
1C,0,0,0,0,0,310.1,32.2,04.11.2021,10
1C,1,0,0,0,0,312.0,56.333333333333336,23.05.2022,8
1C,1,0,0,0,0,,,23.05.2022,1
1C,1,0,0,0,0,108.0,13.333333333333334,23.05.2022,3
1C,1,0,1,0,0,,,23.05.2022,0
1C,1,0,1,0,0,,,23.05.2022,0
1C,1,0,1,0,0,,,23.05.2022,0
1C,0,1,0,0,0,,,23.05.2022,0
1C,0,1,0,0,0,,,23.05.2022,0
1C,0,1,0,0,0,,,23.05.2022,0
1C,0,1,1,0,0,,,23.05.2022,1
1C,0,1,1,0,0,,,23.05.2022,1
1C,0,1,1,0,0,,,23.05.2022,0
1C,0,0,1,0,0,112.66666666666669,21.166666666666668,23.05.2022,8
1C,0,0,1,0,0,132.0,14.5,23.05.2022,0
1C,0,0,1,0,0,244.25,46.0,23.05.2022,9
1C,0,0,0,1,0,200.0,36.0,23.05.2022,2
1C,0,0,0,1,0,144.85714285714286,30.571428571428573,23.05.2022,4
1C,0,0,0,1,0,334.1666666666667,63.75,23.05.2022,14
1C,0,0,0,0,0,296.25,52.0,23.05.2022,0
1C,0,0,0,0,0,,,23.05.2022,0
1C,0,0,0,0,0,,,23.05.2022,10
3A,1,0,0,0,0,40.0,26.0,06.2021,1
3A,1,0,0,0,0,,,06.2021,0
3A,1,0,0,0,0,40.0,64.0,06.2021,1
3A,1,0,1,0,0,,,06.2021,0
3A,1,0,1,0,0,47.5,60.0,06.2021,2
3A,1,0,1,0,0,50.0,84.0,06.2021,1
3A,0,1,0,0,0,,,06.2021,0
3A,0,1,0,0,0,22.5,39.0,06.2021,2
3A,0,1,0,0,0,,,06.2021,0
3A,0,1,1,0,0,15.0,28.0,06.2021,1
3A,0,1,1,0,0,42.5,57.0,06.2021,2
3A,0,1,1,0,0,,,06.2021,0
3A,0,0,1,0,0,26.0,68.0,06.2021,5
3A,0,0,1,0,0,27.5,94.0,06.2021,2
3A,0,0,1,0,0,37.142857142857146,197.14285714285717,06.2021,7
3A,0,0,0,1,0,34.166666666666664,40.333333333333336,06.2021,6
3A,0,0,0,1,0,,,06.2021,0
3A,0,0,0,1,0,43.333333333333336,114.33333333333331,06.2021,6
3A,0,0,0,0,0,31.0,81.6,06.2021,5
3A,0,0,0,0,0,15.0,36.0,06.2021,3
3A,0,0,0,0,0,36.42857142857143,208.0,06.2021,7
3A,1,0,0,0,0,,,03.11.2021,8
3A,1,0,0,0,0,,,03.11.2021,0
3A,1,0,0,0,0,,,03.11.2021,2
3A,1,0,1,0,0,,,03.11.2021,2
3A,1,0,1,0,0,,,03.11.2021,6
3A,1,0,1,0,0,,,03.11.2021,4
3A,0,1,0,0,0,,,03.11.2021,0
3A,0,1,0,0,0,,,03.11.2021,2
3A,0,1,0,0,0,,,03.11.2021,1
3A,0,1,1,0,0,,,03.11.2021,2
3A,0,1,1,0,0,,,03.11.2021,3
3A,0,1,1,0,0,,,03.11.2021,1
3A,0,0,1,0,0,,,03.11.2021,8
3A,0,0,1,0,0,,,03.11.2021,1
3A,0,0,1,0,0,,,03.11.2021,24
3A,0,0,0,1,0,,,03.11.2021,6
3A,0,0,0,1,0,,,03.11.2021,3
3A,0,0,0,1,0,,,03.11.2021,12
3A,0,0,0,0,1,,,03.11.2021,16
3A,0,0,0,0,1,,,03.11.2021,2
3A,0,0,0,0,1,,,03.11.2021,35
3A,1,0,0,0,0,72.0,6.5,23.05.2022,2
3A,1,0,0,0,0,,,23.05.2022,0
3A,1,0,0,0,0,155.0,10.25,23.05.2022,4
3A,1,0,1,0,0,154.66666666666666,15.0,23.05.2022,6
3A,1,0,1,0,0,102.0,10.0,23.05.2022,1
3A,1,0,1,0,0,131.25,12.0,23.05.2022,4
3A,0,1,0,0,0,73.33333333333333,8.666666666666666,23.05.2022,3
3A,0,1,0,0,0,80.75,9.0,23.05.2022,4
3A,0,1,0,0,0,35.0,4.0,23.05.2022,1
3A,0,1,1,0,0,114.83333333333331,10.0,23.05.2022,6
3A,0,1,1,0,0,160.0,12.0,23.05.2022,1
3A,0,1,1,0,0,141.66666666666666,11.0,23.05.2022,3
3A,0,0,1,0,0,160.16666666666666,15.0,23.05.2022,12
3A,0,0,1,0,0,96.16666666666669,11.666666666666666,23.05.2022,6
3A,0,0,1,0,0,125.4,10.4,23.05.2022,5
3A,0,0,0,1,0,144.85714285714286,12.5,23.05.2022,8
3A,0,0,0,1,0,160.0,11.0,23.05.2022,2
3A,0,0,0,1,0,143.33333333333334,11.666666666666666,23.05.2022,6
3A,0,0,0,0,1,217.0,16.2,23.05.2022,10
3A,0,0,0,0,1,118.0,13.75,23.05.2022,4
3A,0,0,0,0,1,148.22222222222223,16.22222222222222,23.05.2022,9
