\babel@toc {english}{}
\contentsline {section}{\numberline {1}High level functions from hardware}{2}%
\contentsline {subsection}{\numberline {1.1}NOT A}{2}%
\contentsline {subsection}{\numberline {1.2}OPPOSIT of A }{2}%
\contentsline {subsection}{\numberline {1.3}SOUSTRACTION A-B}{2}%
\contentsline {subsection}{\numberline {1.4}AND}{2}%
