\relax 
\@nameuse{bbl@beforestart}
\babel@aux{english}{}
\@writefile{toc}{\contentsline {section}{\numberline {1}High level functions from hardware}{2}\protected@file@percent }
\@writefile{toc}{\contentsline {subsection}{\numberline {1.1}NOT A}{2}\protected@file@percent }
\@writefile{toc}{\contentsline {subsection}{\numberline {1.2}OPPOSIT of A }{2}\protected@file@percent }
\@writefile{toc}{\contentsline {subsection}{\numberline {1.3}SOUSTRACTION A-B}{2}\protected@file@percent }
\@writefile{toc}{\contentsline {subsection}{\numberline {1.4}AND}{2}\protected@file@percent }
