{
  "api_timestamp": 1649596935.4391775,
  "api_timezone": "UTC",
  "items": [
    {
      "available_upto": 2147483647,
      "id": 1,
      "network_address": "node1",
      "state": "Alive"
    },
    {
      "available_upto": 2147483647,
      "id": 2,
      "network_address": "node2",
      "state": "Alive"
    },
    {
      "available_upto": 2147483647,
      "id": 3,
      "network_address": "node3",
      "state": "Alive"
    },
    {
      "available_upto": 2147483647,
      "id": 4,
      "network_address": "node4",
      "state": "Alive"
    },
    {
      "available_upto": 2147483647,
      "id": 5,
      "network_address": "node5",
      "state": "Alive"
    },
    {
      "available_upto": 2147483647,
      "id": 6,
      "network_address": "node6",
      "state": "Down"
    },
    {
      "available_upto": 2147483647,
      "id": 7,
      "network_address": "node7",
      "state": "Down"
    },
    {
      "available_upto": 2147483647,
      "id": 8,
      "network_address": "node8",
      "state": "Down"
    },
    {
      "available_upto": 2147483647,
      "id": 9,
      "network_address": "node10",
      "state": "Down"
    },
    {
      "available_upto": 2147483647,
      "id": 10,
      "network_address": "node11",
      "state": "Down"
    },
    {
      "available_upto": 2147483647,
      "id": 11,
      "network_address": "node12",
      "state": "Down"
    }
  ]
}
