,,,,,,,,,,,,,,,,,,
,,,,,,,,,,,,,,,,,,
ANNÉE SCOLAIRE : 2020-2021,,,,,,,,,,,,,,,,,,
Diplôme : RÉSEAUX INFORMATIQUES ET COMMUNICATION MULTIMÉDIA (RICM) - 4ème année : INFO4 ,,,,,,,,,,,,,,,,,,
KAIRIC1/106 (VDI) - KAI4RI/106 (VET) ,,,,,,,,,,,,,,,,,,
,,,,,,,,,,,,,,,,,,
Code APOGÉE,Intitulé,Crédits ECTS,Coefficient,Coefficient dans l'UE,,Nombre d'heures maquette étudiants,,,,,,,,,,,,Modalité contrôle de connaissances
KARI7S01,SEMESTRE 7,,,,,Cours,Nombre de groupes de cours,TD,Nombre de groupes de TD,TP,Nombre de groupes de TP,Nombre d'enseignants par groupes de TP,Projet  heures maquette étudiant,Projet heures maquette CTI,Coût projet 19-20,Exam,,
KARI7U01,UE1 : SHEJS,6,6,,,,,,,,,,,,,,,
KAX7SHTC,Modules transversaux TC,,,0.55,,,,42,,,,,,,,,,CC
KARI7M02,Anglais,,,0.3,,,,22,,,,,,,,,,CC
KAX7DPTC,Développement personnel TC,,,0.15,,,,12,,,,,,,,,,Rapport + soutenance
KARI7U06, UE2 : LANGAGES ET ALGORITHMIQUE,7,7,,,,,,,,,,,,,,,
KARI7M04,Langages et traducteurs ,,,0.33,,18,,6,,10,,,,,,2,,CC
KARI7M05,Complexité algorithmique,,,0.33,,15,,15,,,,,,,,,,CC + Examen
KARI7M13,Algorithmique et programmation fonctionnelle,,,0.34,,13,,15,,30,,,,,,2,,CC
KARI7U07,UE3 : PRÉSENTATION ET STOCKAGE DES DONNÉES,6,6,,,,,,,,,,,,,,,
KARI7M06,Ingénierie de l’interaction homme-machine ,,,0.5,,18,,,,18,,,,,,2,,CC + Examen
KARI7M08,Bases de données ,,,0.5,,17,,,,16,,,,,,2,,CC + Examen
KARI7U04,UE4 : SYSTÈME ET RÉSEAU,6,6,,,,,,,,,,,,,,,
KARI7M09, Programmation Concurrente,,,0.5,,15,,12,,24,,,,,,2,,CC + Examen
KARI7M10,Technologie des réseaux ,,,0.5,,18,,,,18,,,,,,2,,CC + Examen
KARI7U05,UE5 : MATHÉMATIQUES APPLIQUÉES,5,5,,,,,,,,,,,,,,,
KARI7M11,Probabilités et simulation ,,,0.5,,18,,16,,,,,,,,2,,CC + Examen
KARI7M12,Recherche Opérationnelle ,,,0.5,,18,,15,,3,,,,,,2,,CC
,TOTAL SEMESTRE 7,=C9+C13+C17+C20+C23,=D9+D13+D17+D20+D23,,,,,,,,,,,,,,,
,,,,,,,,,,,,,,,,,,
KARI8S01,SEMESTRE 8,,,,,,,,,,,,,,,,,
KARI8U01,UE1 : SCIENCES POUR L'INGÉNIEUR,8,8,,,,,,,,,,,,,,,
KARI8M01,Gestion ,,,0.25,,14,,2,,,,,,,,,,Rapport + soutenance
KARI8M02,Anglais,,,0.25,,,,22,,,,,,,,,,CC (et Bulats)
KARI8M03,Génie logiciel ,,,0.25,,15,,15,,,,,,,,,,Rendu TP + Exam
KARI8M04,Applications Réparties ,,,0.25,,15,,15,,,,,,,,,,CC + Examen
KARI8T02,UE2 : PROJET ET STAGE,10,10,,,,,,,,,,,,,,,
KARI8M16,Projet d'ingénierie,,,0.25,,3,,15,,24,,,,,,,,Rapport + soutenance
KARI8M05,Stage en entreprise ,,,0.75,,,,,,,,,,,,,,Rapport + soutenance
KARI8O01,OPTION 1 : OPTION SYSTÈMES,,,,,,,,,,,,,,,,,
KARI8U03,UE3 : SYSTÈMES DISTRIBUÉS,6,6,,,,,,,,,,,,,,,
KARI8M08,Interconnexion de réseaux,,,0.5,,15,,18,,,,,,,,2,,CC + Examen
KARI8M07,Algorithmique parallèle et distribuée ,,,0.5,,15,,15,,,,,,,,2,,Rendu TP + Exam
KARI8U04,UE4 : SYSTÈME ET RESEAU AVANCÉ,6,6,,,,,,,,,,,,,,,
KARI8M09,Architecture de systèmes ,,,0.6,,15,,,,30,,,,,,2,,CC + Examen
KARI8M10,Évaluation de performances ,,,0.4,,15,,15,,,,,,,,2,,CC + Examen
KARI8O02,OPTION 2 : OPTION MULTIMÉDIA,,,,,,,,,,,,,,,,,
KARI8U05,UE3 : SON ET IMAGES,6,6,,,,,,,,,,,,,,,
KARI8M15,Traitement du signal ,,,0.5,,15,,15,,,,,,,,2,,CC + Exam
KARI8M12,Synthèse d’images ,,,0.5,,15,,16,,,,,,,,2,,CC
KARI8U06,UE4 : TEXTE ET DONNEES,6,6,,,,,,,,,,,,,,,
KARI8M13,Communication langagière ,,,0.5,,15,,,,18,,,,,,2,,CC + Examen
KARI8M14,Accès et recherche d'information,,,0.5,,18,,18,,,,,,,,2,,CC + Examen
,,,,,,,,,,,,,,,,,,
,TOTAL SEMESTRE 8,30,30,,,,,,,,,,,,,,,
,TOTAL ANNÉE,60,60,,,,,,,,,,,,,,,
