,,,,,,,,,,,,,,,,,,,,
,,,,,,,,,,,,,,,,,,,,
ANNÉE SCOLAIRE : 2020-2021,,,,,,,,,,,,,,,,,,,,
Diplôme : RÉSEAUX INFORMATIQUES ET COMMUNICATION MULTIMÉDIA (RICM) - 3ème année : INFO3,,,,,,,,,,,,,,,,,,,,
KAIRIC1/106 (VDI) - KAI3RI/160 (VET),,,,,,,,,,,,,,,,,,,,
,,,,,,,,,,,,,,,,,,,,
,,,,,,,,,,,,,,,,,,,,
Code APOGÉE,Intitulé,Crédits ECTS,Coefficient,Coefficient dans l'UE,,,Nombre d'heures maquette étudiants,,,,,,,,,,,,Modalité contrôle de connaissances,
KARI5S01,SEMESTRE 5,,,,,,Cours,Nombre de groupes de cours,TD,Nombre de groupes de TD,TP,Nombre de groupes de TP,Nombre d'enseignants par groupes de TP,Projet  heures maquette étudiant,Projet heures maquette CTI,Coût projet 19-20,Exam,,,
KAX5U001,UE1 : TRONC COMMUN 1,8,8,,,,,,,,,,,,,,,,,
KAX5ANTC,Anglais TC,,,0.4,,,,,37,,,,,,,,,,CC + Exam,
KAX5COTC,Communication TC,,,0,,,,,10,,,,,,,,,,CC,
KAX5EDTC,Économie - Droit TC,,,0.2,,,,,16,,,,,,,,,,Exam,
KAX5MATC,Mathématiques TC,,,0.4,,,18,,16,,2,,,,,,,,Exam,
KARI5U07,UE2 : MATHÉMATIQUES POUR L'INFORMATIQUE,6,6,,,,,,,,,,,,,,,,,
KARI5M05,Mathématiques discrètes (MD),,,0.5,,,15,,18,,,,,,,,3,,CC + Exam,
KARI5M06,Automates et grammaires (A&G),,,0.5,,,13.5,,16,,3,,,,,,3,,CC,
KARI5U03,UE3 : ALGORITHME-PROGRAMMATION 1,8,8,,,,,,,,,,,,,,,,,
KARI5M07,Algorithmique et programmation impérative (API),,,0.6,,,15,,20,,18,,,,,,2,,Rendu TP + Exam,
KARI5M12,Programmation orientée objet (POO1),,,0.4,,,,,,,44,,,,,,,,CC,
KARI5U08,UE4 : ARCHITECTURE-SYSTÈME 1,8,8,,,,,,,,,,,,,,,,,
KARI5M10,Architecture logicielle et matérielle (ALM1),,,0.7,,,,,54,,3,,,,,,3,,CC + Rendu TP + Exam,
KARI5M11,Linux Install Party (INFO3),,,0,,,1.5,,,,4,,,,,,,,Quitus,
KARI5M13,UNIX en autonomie,,,0,,,1.5,,,,1.5,,,,,,,,Quitus,
KARI5M14,PROG C en autonomie,,,0,,,3,,,,2,,,,,,,,Quitus,
KARI5M15,Langage C pour la programmation système (CPS),,,0.3,,,9,,,,15,,,,,,2,,CC + Exam,
,TOTAL SEMESTRE 5,=C21+C18+C15+C10,=D21+D18+D15+D10,,,,,,,,,,,,,,,,,
,,,,,,,,,,,,,,,,,,,,
KARI6S01,SEMESTRE 6,,,,,,,,,,,,,,,,,,,
KAX6U001,UE1 : TRONC COMMUN 2,7,7,,,,,,,,,,,,,,,,,
KAX6ANTC,Anglais TC,,,0.3,,,,,26,,,,,,,,,,Rapport + soutenance,
KAX6COTC,Communication TC,,,0.1,,,,,16,,,,,,,,,,Exam,
KAX6GETC,Gestion TC,,,0.4,,,,,37,,,,,,,,,,Rendu TP + Exam,
KAX6MASP,Mathématiques de spécialité,,,0.2,,,18,,18,,,,,,,,,,CC + Exam,
KARI6U02,UE2 : MATHÉMATIQUES ET APPLICATIONS,5,5,,,,,,,,,,,,,,,,,
KARI6M05,Méthodes numériques (MN),,,0.54,,,13.5,,7.5,,7.5,,,,,,2,,CC + Exam,
KARI6M06,Traitement du signal (TS),,,0.46,,,13.5,,7.5,,6,,,,,,2,,Rendu TP + Exam,
KARI6U03,UE3 : ALGORITHME-PROGRAMMATION 2,6,6,,,,,,,,,,,,,,,,,
KARI6M16,Programmation WEB (PW),,,0.4,,,10.5,,,,18,,,,,,2,,CC + Exam,
KARI6M08,Algorithmique avancée (ALG),,,0.35,,,12,,4,,9,,,,,,2,,CC + Exam,
KARI6M07,Programmation orientée objet (POO2),,,0.25,,,,,,,18,,,,,,,,CC,
KARI6U04,UE4 : ARCHITECTURE-SYSTÈME 2,6,6,,,,,,,,,,,,,,,,,
KARI6M10,Communications numériques (CN),,,0.3,,,13,,,,12,,,,,,2,,Rendu TP + Exam,
KARI6M11,Réseaux (RX),,,0.3,,,13,,,,18,,,,,,2,,Rendu TP + Exam,
KARI6M12,Architecture logicielle et matérielle (ALM2),,,0.4,,,13,,14,,6,,,,,,2,,Rendu TP + Exam,
KARI6U05,UE5 :  PROJETS ET ACTIVITÉS SPORTIVES,6,6,,,,,,,,,,,,,,,,,
KARI6M17,Gestion de Projet Informatique (GPI),,,0.25,,,9,,4,,,,,12,12,,,,Soutenance,
KARI6M14,Projet logiciel niveau applicatif (PLA),,,0.5,,,7.5,,,,,,,88,88,,24,,Soutenance,
KARI6M15,Mise en situation via le sport,,,0.25,,,,,24,,,,,,,,,,CC,
,TOTAL SEMESTRE 6,=C46+C42+C38+C35+C30,=D46+D42+D38+D35+D30,,,,,,,,,,,,,,,,,
,TOTAL ANNÉE,60,60,,,,=SUM(H11:H49),,=SUM(J11:J49),,=SUM(L11:L49),,,100,100,,=SUM(R11:R49),,,
