[gd_scene load_steps=3 format=2]

[ext_resource path="res://Ressources/Cell/TurquoiseCell.gd" type="Script" id=1]
[ext_resource path="res://Assets/CaseTurquoise.png" type="Texture" id=2]

[node name="Node2D" type="Node2D"]
script = ExtResource( 1 )

[node name="CaseTurquoise" type="Sprite" parent="."]
position = Vector2( 32, 32 )
scale = Vector2( 2, 2 )
texture = ExtResource( 2 )
