[gd_scene load_steps=3 format=2]

[ext_resource path="res://Assets/BluePiece.png" type="Texture" id=1]
[ext_resource path="res://Ressources/Players/BluePiece.gd" type="Script" id=2]

[node name="Node2D" type="Node2D"]
script = ExtResource( 2 )

[node name="BluePiece" type="Sprite" parent="."]
position = Vector2( 32, 16 )
scale = Vector2( 0.75, 0.75 )
texture = ExtResource( 1 )
