{
   "api_timestamp" : 1522154281,
   "total" : 24,
   "items" : [
      {
         "state" : "Alive",
         "api_timestamp" : 1522154281,
         "id" : 1,
         "network_address" : "node1",
         "available_upto" : 2147483647,
         "links" : [
            {
               "title" : "node",
               "href" : "/oarapi/resources/nodes/node1",
               "rel" : "member"
            },
            {
               "rel" : "self",
               "href" : "/oarapi/resources/1"
            },
            {
               "href" : "/oarapi/resources/1/jobs",
               "title" : "jobs",
               "rel" : "collection"
            }
         ]
      },
      {
         "network_address" : "node1",
         "id" : 2,
         "api_timestamp" : 1522154281,
         "state" : "Alive",
         "links" : [
            {
               "rel" : "member",
               "href" : "/oarapi/resources/nodes/node1",
               "title" : "node"
            },
            {
               "href" : "/oarapi/resources/2",
               "rel" : "self"
            },
            {
               "rel" : "collection",
               "href" : "/oarapi/resources/2/jobs",
               "title" : "jobs"
            }
         ],
         "available_upto" : 2147483647
      },
      {
         "links" : [
            {
               "rel" : "member",
               "href" : "/oarapi/resources/nodes/node1",
               "title" : "node"
            },
            {
               "href" : "/oarapi/resources/3",
               "rel" : "self"
            },
            {
               "rel" : "collection",
               "title" : "jobs",
               "href" : "/oarapi/resources/3/jobs"
            }
         ],
         "available_upto" : 2147483647,
         "network_address" : "node1",
         "api_timestamp" : 1522154281,
         "id" : 3,
         "state" : "Alive"
      },
      {
         "links" : [
            {
               "rel" : "member",
               "title" : "node",
               "href" : "/oarapi/resources/nodes/node1"
            },
            {
               "rel" : "self",
               "href" : "/oarapi/resources/4"
            },
            {
               "rel" : "collection",
               "title" : "jobs",
               "href" : "/oarapi/resources/4/jobs"
            }
         ],
         "available_upto" : 2147483647,
         "network_address" : "node1",
         "api_timestamp" : 1522154281,
         "id" : 4,
         "state" : "Alive"
      },
      {
         "links" : [
            {
               "href" : "/oarapi/resources/nodes/node1",
               "title" : "node",
               "rel" : "member"
            },
            {
               "href" : "/oarapi/resources/5",
               "rel" : "self"
            },
            {
               "href" : "/oarapi/resources/5/jobs",
               "title" : "jobs",
               "rel" : "collection"
            }
         ],
         "available_upto" : 2147483647,
         "network_address" : "node1",
         "api_timestamp" : 1522154281,
         "id" : 5,
         "state" : "Alive"
      },
      {
         "available_upto" : 2147483647,
         "links" : [
            {
               "href" : "/oarapi/resources/nodes/node1",
               "title" : "node",
               "rel" : "member"
            },
            {
               "href" : "/oarapi/resources/6",
               "rel" : "self"
            },
            {
               "rel" : "collection",
               "href" : "/oarapi/resources/6/jobs",
               "title" : "jobs"
            }
         ],
         "state" : "Alive",
         "id" : 6,
         "api_timestamp" : 1522154281,
         "network_address" : "node1"
      },
      {
         "state" : "Alive",
         "network_address" : "node1",
         "api_timestamp" : 1522154281,
         "id" : 7,
         "available_upto" : 2147483647,
         "links" : [
            {
               "href" : "/oarapi/resources/nodes/node1",
               "title" : "node",
               "rel" : "member"
            },
            {
               "href" : "/oarapi/resources/7",
               "rel" : "self"
            },
            {
               "rel" : "collection",
               "href" : "/oarapi/resources/7/jobs",
               "title" : "jobs"
            }
         ]
      },
      {
         "available_upto" : 2147483647,
         "links" : [
            {
               "rel" : "member",
               "title" : "node",
               "href" : "/oarapi/resources/nodes/node1"
            },
            {
               "href" : "/oarapi/resources/8",
               "rel" : "self"
            },
            {
               "href" : "/oarapi/resources/8/jobs",
               "title" : "jobs",
               "rel" : "collection"
            }
         ],
         "state" : "Alive",
         "api_timestamp" : 1522154281,
         "id" : 8,
         "network_address" : "node1"
      },
      {
         "available_upto" : 2147483647,
         "links" : [
            {
               "rel" : "member",
               "title" : "node",
               "href" : "/oarapi/resources/nodes/node2"
            },
            {
               "rel" : "self",
               "href" : "/oarapi/resources/9"
            },
            {
               "href" : "/oarapi/resources/9/jobs",
               "title" : "jobs",
               "rel" : "collection"
            }
         ],
         "state" : "Alive",
         "id" : 9,
         "api_timestamp" : 1522154281,
         "network_address" : "node2"
      },
      {
         "state" : "Alive",
         "id" : 10,
         "api_timestamp" : 1522154281,
         "network_address" : "node2",
         "available_upto" : 2147483647,
         "links" : [
            {
               "rel" : "member",
               "title" : "node",
               "href" : "/oarapi/resources/nodes/node2"
            },
            {
               "href" : "/oarapi/resources/10",
               "rel" : "self"
            },
            {
               "title" : "jobs",
               "href" : "/oarapi/resources/10/jobs",
               "rel" : "collection"
            }
         ]
      },
      {
         "links" : [
            {
               "href" : "/oarapi/resources/nodes/node2",
               "title" : "node",
               "rel" : "member"
            },
            {
               "rel" : "self",
               "href" : "/oarapi/resources/11"
            },
            {
               "title" : "jobs",
               "href" : "/oarapi/resources/11/jobs",
               "rel" : "collection"
            }
         ],
         "available_upto" : 2147483647,
         "api_timestamp" : 1522154281,
         "id" : 11,
         "network_address" : "node2",
         "state" : "Alive"
      },
      {
         "state" : "Alive",
         "network_address" : "node2",
         "id" : 12,
         "api_timestamp" : 1522154281,
         "available_upto" : 2147483647,
         "links" : [
            {
               "title" : "node",
               "href" : "/oarapi/resources/nodes/node2",
               "rel" : "member"
            },
            {
               "href" : "/oarapi/resources/12",
               "rel" : "self"
            },
            {
               "href" : "/oarapi/resources/12/jobs",
               "title" : "jobs",
               "rel" : "collection"
            }
         ]
      },
      {
         "state" : "Alive",
         "network_address" : "node2",
         "api_timestamp" : 1522154281,
         "id" : 13,
         "available_upto" : 2147483647,
         "links" : [
            {
               "rel" : "member",
               "href" : "/oarapi/resources/nodes/node2",
               "title" : "node"
            },
            {
               "href" : "/oarapi/resources/13",
               "rel" : "self"
            },
            {
               "rel" : "collection",
               "title" : "jobs",
               "href" : "/oarapi/resources/13/jobs"
            }
         ]
      },
      {
         "links" : [
            {
               "href" : "/oarapi/resources/nodes/node2",
               "title" : "node",
               "rel" : "member"
            },
            {
               "rel" : "self",
               "href" : "/oarapi/resources/14"
            },
            {
               "title" : "jobs",
               "href" : "/oarapi/resources/14/jobs",
               "rel" : "collection"
            }
         ],
         "available_upto" : 2147483647,
         "network_address" : "node2",
         "id" : 14,
         "api_timestamp" : 1522154281,
         "state" : "Alive"
      },
      {
         "network_address" : "node2",
         "id" : 15,
         "api_timestamp" : 1522154281,
         "state" : "Alive",
         "links" : [
            {
               "href" : "/oarapi/resources/nodes/node2",
               "title" : "node",
               "rel" : "member"
            },
            {
               "rel" : "self",
               "href" : "/oarapi/resources/15"
            },
            {
               "rel" : "collection",
               "href" : "/oarapi/resources/15/jobs",
               "title" : "jobs"
            }
         ],
         "available_upto" : 2147483647
      },
      {
         "links" : [
            {
               "rel" : "member",
               "title" : "node",
               "href" : "/oarapi/resources/nodes/node2"
            },
            {
               "rel" : "self",
               "href" : "/oarapi/resources/16"
            },
            {
               "href" : "/oarapi/resources/16/jobs",
               "title" : "jobs",
               "rel" : "collection"
            }
         ],
         "available_upto" : 2147483647,
         "network_address" : "node2",
         "id" : 16,
         "api_timestamp" : 1522154281,
         "state" : "Alive"
      },
      {
         "state" : "Alive",
         "id" : 17,
         "api_timestamp" : 1522154281,
         "network_address" : "node3",
         "available_upto" : 2147483647,
         "links" : [
            {
               "rel" : "member",
               "href" : "/oarapi/resources/nodes/node3",
               "title" : "node"
            },
            {
               "rel" : "self",
               "href" : "/oarapi/resources/17"
            },
            {
               "rel" : "collection",
               "title" : "jobs",
               "href" : "/oarapi/resources/17/jobs"
            }
         ]
      },
      {
         "available_upto" : 2147483647,
         "links" : [
            {
               "rel" : "member",
               "title" : "node",
               "href" : "/oarapi/resources/nodes/node3"
            },
            {
               "rel" : "self",
               "href" : "/oarapi/resources/18"
            },
            {
               "rel" : "collection",
               "title" : "jobs",
               "href" : "/oarapi/resources/18/jobs"
            }
         ],
         "state" : "Alive",
         "network_address" : "node3",
         "id" : 18,
         "api_timestamp" : 1522154281
      },
      {
         "api_timestamp" : 1522154281,
         "id" : 19,
         "network_address" : "node3",
         "state" : "Alive",
         "links" : [
            {
               "href" : "/oarapi/resources/nodes/node3",
               "title" : "node",
               "rel" : "member"
            },
            {
               "rel" : "self",
               "href" : "/oarapi/resources/19"
            },
            {
               "rel" : "collection",
               "href" : "/oarapi/resources/19/jobs",
               "title" : "jobs"
            }
         ],
         "available_upto" : 2147483647
      },
      {
         "network_address" : "node3",
         "api_timestamp" : 1522154281,
         "id" : 20,
         "state" : "Alive",
         "links" : [
            {
               "rel" : "member",
               "title" : "node",
               "href" : "/oarapi/resources/nodes/node3"
            },
            {
               "href" : "/oarapi/resources/20",
               "rel" : "self"
            },
            {
               "rel" : "collection",
               "href" : "/oarapi/resources/20/jobs",
               "title" : "jobs"
            }
         ],
         "available_upto" : 2147483647
      },
      {
         "state" : "Alive",
         "id" : 21,
         "api_timestamp" : 1522154281,
         "network_address" : "node3",
         "available_upto" : 2147483647,
         "links" : [
            {
               "href" : "/oarapi/resources/nodes/node3",
               "title" : "node",
               "rel" : "member"
            },
            {
               "href" : "/oarapi/resources/21",
               "rel" : "self"
            },
            {
               "rel" : "collection",
               "href" : "/oarapi/resources/21/jobs",
               "title" : "jobs"
            }
         ]
      },
      {
         "links" : [
            {
               "title" : "node",
               "href" : "/oarapi/resources/nodes/node3",
               "rel" : "member"
            },
            {
               "href" : "/oarapi/resources/22",
               "rel" : "self"
            },
            {
               "rel" : "collection",
               "title" : "jobs",
               "href" : "/oarapi/resources/22/jobs"
            }
         ],
         "available_upto" : 2147483647,
         "network_address" : "node3",
         "api_timestamp" : 1522154281,
         "id" : 22,
         "state" : "Alive"
      },
      {
         "available_upto" : 2147483647,
         "links" : [
            {
               "rel" : "member",
               "href" : "/oarapi/resources/nodes/node3",
               "title" : "node"
            },
            {
               "rel" : "self",
               "href" : "/oarapi/resources/23"
            },
            {
               "href" : "/oarapi/resources/23/jobs",
               "title" : "jobs",
               "rel" : "collection"
            }
         ],
         "state" : "Alive",
         "api_timestamp" : 1522154281,
         "id" : 23,
         "network_address" : "node3"
      },
      {
         "available_upto" : 2147483647,
         "links" : [
            {
               "href" : "/oarapi/resources/nodes/node3",
               "title" : "node",
               "rel" : "member"
            },
            {
               "href" : "/oarapi/resources/24",
               "rel" : "self"
            },
            {
               "rel" : "collection",
               "href" : "/oarapi/resources/24/jobs",
               "title" : "jobs"
            }
         ],
         "state" : "Alive",
         "api_timestamp" : 1522154281,
         "id" : 24,
         "network_address" : "node3"
      }
   ],
   "links" : [
      {
         "rel" : "self",
         "href" : "/oarapi/resources.json?offset=0"
      }
   ],
   "offset" : 0
}

