<?xml version="1.0" encoding="utf-8"?>
<!-- Generator: Adobe Illustrator 28.1.0, SVG Export Plug-In . SVG Version: 6.00 Build 0)  -->
<!DOCTYPE svg PUBLIC "-//W3C//DTD SVG 1.1//EN" "http://www.w3.org/Graphics/SVG/1.1/DTD/svg11.dtd" [
	<!ENTITY ns_extend "http://ns.adobe.com/Extensibility/1.0/">
	<!ENTITY ns_ai "http://ns.adobe.com/AdobeIllustrator/10.0/">
	<!ENTITY ns_graphs "http://ns.adobe.com/Graphs/1.0/">
	<!ENTITY ns_vars "http://ns.adobe.com/Variables/1.0/">
	<!ENTITY ns_imrep "http://ns.adobe.com/ImageReplacement/1.0/">
	<!ENTITY ns_sfw "http://ns.adobe.com/SaveForWeb/1.0/">
	<!ENTITY ns_custom "http://ns.adobe.com/GenericCustomNamespace/1.0/">
	<!ENTITY ns_adobe_xpath "http://ns.adobe.com/XPath/1.0/">
]>
<svg version="1.1" id="Calque_1" xmlns:x="&ns_extend;" xmlns:i="&ns_ai;" xmlns:graph="&ns_graphs;"
	 xmlns="http://www.w3.org/2000/svg" xmlns:xlink="http://www.w3.org/1999/xlink" x="0px" y="0px" viewBox="0 0 32 32"
	 style="enable-background:new 0 0 32 32;" xml:space="preserve">
<style type="text/css">
	.st0{clip-path:url(#SVGID_00000000210666766869167990000000609957097509705120_);fill:#FFEFC7;stroke:#000000;stroke-width:0.5;}
	.st1{fill:#FFEFC7;stroke:#000000;stroke-width:0.5;}
</style>
<metadata>
	<sfw  xmlns="&ns_sfw;">
		<slices></slices>
		<sliceSourceBounds  bottomLeftOrigin="true" height="26.4" width="25.2" x="3.5" y="2.9"></sliceSourceBounds>
	</sfw>
</metadata>
<g id="Calque_5">
	<g>
		<g>
			<g>
				<g>
					<defs>
						<rect id="SVGID_1_" x="3.5" y="2.8" width="25.2" height="26.4"/>
					</defs>
					<clipPath id="SVGID_00000093177152804921685370000012355297566882963080_">
						<use xlink:href="#SVGID_1_"  style="overflow:visible;"/>
					</clipPath>
					
						<polygon style="clip-path:url(#SVGID_00000093177152804921685370000012355297566882963080_);fill:#FFEFC7;stroke:#000000;stroke-width:0.5;" points="
						10.8,5.7 14.5,9.3 18.4,3.7 19.7,8.4 25.4,6.5 22.2,13.6 27.4,13.6 23,16.9 26.6,22.5 21.4,21 20.5,27.1 17.3,22.6 13.3,28.2 
						12.1,22.6 6.8,25.9 10,21 5.2,19.4 8.8,16.9 4.4,10.2 11.2,11.8 					"/>
				</g>
			</g>
		</g>
	</g>
	<polygon class="st1" points="13.6,11.2 15.3,12.9 17.1,10.3 17.7,12.4 20.2,11.6 18.8,14.9 21.2,14.9 19.1,16.4 20.8,19 18.4,18.3 
		18,21.1 16.5,19 14.7,21.6 14.1,19 11.8,20.5 13.2,18.3 11,17.6 12.7,16.4 10.6,13.3 13.8,14 	"/>
</g>
</svg>
