@startuml
'https://plantuml.com/class-diagram

class shared.File {
    id
    date
    year
    day
    name
    processed
    available_metadata
    date_created
    date_processed
    ..
    source_id
}

class shared.Network {
    id
    code
    year
    start
    end
    temporary
    schema
}

class shared.Source {
    id
    station
    location
    channel
    ..
    network_id
}

class tenant.Stream {
    id
    valid
    start
    end
    sampling_rate
    ..
    file_id
    source_id
    epoch_id
}

class tenant.Trace {
    timestamp
    data
    ..
    stream_id
}

class tenant.Epoch {
    id
    start
    end
    instrument
    ..
    source_id
}


class tenant.Gap {
    start
    end
    ..
    stream_id
}

Network "1" *-- "*" Source

Source "1" *-- "*" Epoch
Source "1" *-- "*" Stream

File "1" *-- "*" Stream
File "*" -- "0..1" Source

Stream "1" *-- "*" Trace
Stream "1" *-- "*" Gap
Stream "*" -- "0..1" Epoch

@enduml