ABFA	B
ADEA	A
ANTF	R
ARBF	R
ATE	R
BELV	R
BERA	A
BRGM	A
CAGN	A
CALF	A
CBEA	A
CDSA	A
CGAB	B9.1
CGAH	B9.9
CGAS	S
CGAT	S
CGBP	S
CGCO	R
CGCP	B2.2
CGDB	B11.1
CGDD	R
CGDT	S
CGFR	R
CGLO	S
CGLR	B2.1
CGMB	O
CGMH	O
CGOB	R
CGPA	S
CGPB	B5.1
CGPH	B5.5
CGRA	R
CGRP	O
CGSA	S
CGSJ	S
CGTI	O
CGTR	S
CGVA	S
CGVI	S
CGCA	R
CGDI	R
CGPL	R
ESCA	A
EILF	R
FNEB	R
GBGA	A
GLAN 	R
GRN	R
HOUA	A
IPTA	A
IRAR	R
IRBL	R
IRBS	R 
IRBV	R 
IRCA	R 
IRCH	R 
IRCL	R
IRFO	R
IRGR	R 
IRIS	R
IRJO	R 
IRJQ	R 
IRMA	R 
IRME	R 
IRML	R 
IROB	R 
IRPV	S 
IRSE	R
IRSP	R 
IRVA	R 
IRVG	R 
IRVL	R 
ISO	A
JARA	A
MADI	A
MALA	B
MAMA	A
MAME	A
MASM	A
MASP	A
MATR	B
MAZM	A
MENA	A
MESA	A
MOLA	A
MON	A
NALS	C
NBOR	A
NCAD	C
NLIB	C
NPOR	C
NROC	C
NCAU	R
NSJA	C
OCCD	A
OCKE	E
OCLD	E
OCOR	A
OCSJ	A
OGAG	A
OGAN	A
OGAP	B
OGAV	C
OGBB	A
OGBL	B
OGCA	A
OGCH	A
OGCU	C
OGDH	C
OGDI	B
OGEP	C
OGFO	BH536
PYTO	B20
SURF	R
RSL	R
OG35	R
OG02	R
OGSA	R
NCER	R
SLAF	A
UNCO	R
YTMZ	R
