Z3|2015|A215A|Building 
Z3|2015|A158A|Underground Shelter
Z3|2015|A193A|Free field
Z3|2015|A216A|Free field
Z3|2015|A206A|Free field
Z3|2015|A185A|Building 
Z3|2015|A213A|Free field
Z3|2015|A201A|Building 
Z3|2015|A192A|Free field
Z3|2015|A186A|Free field
Z3|2015|A186B|Building 
Z3|2015|A210A|Free field
Z3|2015|A211A|Free field
Z3|2015|A188A|Building 
Z3|2015|A184A|Building 
Z3|2015|A175A|Building 
Z3|2015|A204A|Building 
Z3|2015|A164A|Building 
Z3|2015|A163A|Free field
Z3|2015|A173A|Free field
Z3|2015|A214A|Cave 
Z3|2015|A217A|Free field
Z3|2015|A194A|Free field
Z3|2015|A160A|Free field
Z3|2015|A157A|Free field
Z3|2015|A199A|Urban free
Z3|2015|A200A|Free field
Z3|2015|A202A|Free field
Z3|2015|A180A|Building 
Z3|2015|A178A|Free field
Z3|2015|A208A|Free field
Z3|2015|A209A|Aqueduct 
Z3|2015|A171A|Free field
Z3|2015|A167A|Free field
Z3|2015|A172A|Free field
Z3|2015|A174A|Building 
Z3|2015|A176A|Building 
Z3|2015|A156A|Free field
Z3|2015|A212A|Free field
Z3|2015|A166A|Free field
Z3|2015|A177A|Building 
Z3|2015|A168A|Building 
Z3|2015|A170A|Building 
Z3|2015|A179A|Building 
Z3|2015|A182A|Building 
Z3|2015|A169A|Cave 
Z3|2015|A161A|Building 
Z3|2015|A196A|Free field
Z3|2015|A165A|Cave 
Z3|2015|A183A|Building 
Z3|2015|A198A|Building 
Z3|2015|A195A|Building 
Z3|2015|A191A|Free field
Z3|2015|A190A|Building 
Z3|2015|A187A|Building 
Z3|2015|A159A|Free field
Z3|2015|A152A|Free field
Z3|2015|A151A|Free field
Z3|2015|A153A|Free field
Z3|2015|A154A|Free field
Z3|2015|A162A|Free field
Z3|2015|A155A|Building 
Z3|2015|A157B|Building 
Z3|2015|A192B|Free field
Z3|2015|A172B|Building 
Z3|2015|A401A|Sea floor
Z3|2015|A413A|Sea floor
Z3|2015|A416A|Sea floor
Z3|2015|A419A|Sea floor
Z3|2015|A422A|Sea floor
Z3|2015|A425A|Sea floor
Z3|2015|A429A|Sea floor
Z3|2015|| 
