{
	"dmp": {
		"title": "Template DMP for seismological data hosted at RESIF",
		"description": "Descibe here the DMP",
		"language": "eng",
		"created": "2021-22-25T12:00:00.000Z",
		"modified": "2021-22-25T12:00:00.000Z",
		"ethical_issues_exist": "no",
		"dmp_id": {
			"identifier": "https://gricad-gitlab.univ-grenoble-alpes.fr/OSUG/RESIF/resif-dmp/dmps/template.json",
			"type": "url"
		},
		"contact": {
			"name": "Helle Pedershen",
			"mbox": "helle.pedershen@univ-grenoble-alpes.fr",
			"contact_id": {
				"identifier": "helle.pedershen@univ-grenoble-alpes.fr",
				"type": "other"
			}
		},
		"contributor": [
			{
				"name": "Jonathan Schaeffer",
                "mbox": "jonathan.schaeffer@univ-grenoble-alpes.fr",
				"contributor_id": {
					"identifier": "https://orcid.org/0000-0002-2447-7394",
					"type": "orcid"
				},
				"role": [
					"Technical head of Résif-DC",
					"ContactPerson",
					"DataManager"
				]
			},
			{
				"name": "David Wolyniec",
				"mbox": "david.wolyniec@univ-grenoble-alpes.fr",
				"contributor_id": {
				    "identifier": "david.wolyniec@univ-grenoble-alpes.fr",
					"type": "other"
				},
				"role": [
					"ContactPerson",
					"DataCurator"
				]
			},
			{
				"name": "Philippe Bollard",
				"mbox": "philippe.bollard@univ-grenoble-alpes.fr",
				"contributor_id": {
					"identifier": "https://orcid.org/0000-0001-9156-7819",
					"type": "orcid"
				},
				"role": [
					"ContactPerson"
				]
			}
		],
        "cost": [],
		"project": [
			{
				"title": "Description of the project linked to this DMP",
                "project_id": "http://project.org/description",
				"project_id_type": "HTTP-PDB",
				"start": "2017-10-01",
				"end": "2020-09-30",
				"description": "<p>This description can have HTML markups</p>",
				"funding": [
					{
						"funder_name": "European Commission - Framework Programme",
						"funder_id": {
							"identifier": "",
							"type": "other"
						},
						"grant_id": {
							"identifier": "EO-2-2017",
							"type": "other"
						}
					}
				]
			}
		],
		"dataset": [
			{
				"dataset_id": {
					"identifier": "https://doi.org/10.15778/RESIF.EXTENDEDNETCODE",
					"type": "doi"
				},
				"title": "Data",
				"personal_data": "no",
				"sensitive_data": "no",
				"type": "dataset",
				"description": "All seismological data in this network",
                "data_quality_assurance": "",
                "issued": "2021-01-01 12:00:00",
                "keyword": [],
                "technical_resource": [],
				"distribution": [
					{
						"title": "Validated data",
						"format": ["miniSeed"],
						"data_access": "open",
                        "access_url": "https://doi.org/10.15778/RESIF.EXTENDEDNETCODE",
                        "download_url": "http://ws.resif.fr/fdsnws/dataselect/1/query?",
						"license": [
							{
								"license_name": "Creative Common CC-by 4.0",
								"license_ref": "http://opensource.org/licenses/mit-license.php",
                                "start_date": "2020-09-30"
							}
						],
						"host": {
                            "$ref": ".resources/dmp.dataset.distribution.host.json"
						}
					}
				],
                "metadata": {
					"description": "Metadata describing the configuraion of the seismological network",
                    "language": "eng",
                    "metadata_standard_id": {
					    "identifier": "http://ws.resif.fr/fdsnws/station/1/query?net=XX&start=YYYY&level=response",
                        "type": "url"
                    }
                },
				"technical_ressource": [
					{
						"name": "",
						"description": ""
					}
				]
			}
		]
	}
}
