#Network|Station|Latitude|Longitude|Elevation|SiteName|StartTime|EndTime
RD|EPF|43.030800|0.340000|750.0|Esparros, France|1977-07-07T00:00:00|2500-12-31T23:59:59
RD|ETNF|48.262200|6.038200|450.0|Estrennes, France|2018-04-01T08:00:00|2500-12-31T23:59:59
RD|ETSF|42.898610|-0.559170|910.0|Etsaut, France|1996-04-01T00:00:00|2500-12-31T23:59:59
RD|FLAF|43.382700|6.254900|295.0|Flassans-sur-Issole, France|1974-01-12T10:30:00|2500-12-31T23:59:59
RD|LFF|44.939500|0.740170|200.0|La Frestale, Aquitaine, France|1969-01-01T08:00:00|2500-12-31T23:59:59
RD|LOR|47.268300|3.858900|520.0|Lormes, France|2013-06-19T00:00:00|2500-12-31T23:59:59
RD|LOT2|47.268300|3.858900|520.0|Lormes, France|2006-11-01T00:00:00|2013-06-19T00:00:00
RD|MFF|46.602200|-0.145800|0.0|Saint Martin du Fouilloux, France|2011-11-18T08:00:00|2500-12-31T23:59:59
RD|MFT2|46.602200|-0.145800|0.0|Saint Martin du Fouilloux, France|2008-03-24T00:00:00|2011-11-18T08:00:00
RD|MTLF|43.341100|2.217500|365.0|Montolieu, France|2013-06-19T00:00:00|2500-12-31T23:59:59
RD|MTT2|43.341100|2.217500|365.0|Montolieu, France|2008-08-01T00:00:00|2013-06-19T00:00:00
RD|ORIF|44.918300|5.880000|1080.0|Oris en Rattier, France|2013-06-19T00:00:00|2500-12-31T23:59:59
RD|ORT2|44.918300|5.880000|1080.0|Oris en Rattier, France|2006-11-11T00:00:00|2013-06-19T00:00:00
RD|PGF|42.548300|8.999400|1130.0|Pioggiola, Corse|2013-06-19T00:00:00|2500-12-31T23:59:59
RD|PGT2|42.548300|8.999400|1130.0|Pioggiola, Corse|2008-01-10T00:00:00|2013-06-19T00:00:00
RD|RJF|45.304400|1.516390|410.0|Les Réjaudoux, France|1975-01-01T08:00:00|2500-12-31T23:59:59
RD|ROSF|48.336400|-3.273600|260.0|Rostrenen, France|2013-06-19T00:00:00|2500-12-31T23:59:59
RD|ROT2|48.336400|-3.273600|260.0|Rostrenen, France|2008-08-27T00:00:00|2013-06-19T00:00:00
RD|SAVF|48.615200|5.124100|264.0|Savonnieres en Perthois, Champagne-Ardenne, France|2018-08-09T08:00:00|2500-12-31T23:59:59
