"Release Date" Object RA DEC "Target Ra Dec" "Target l b" ProgId DP.ID OB.ID DPR.CATG DPR.TYPE DPR.TECH TELESCOPE INS.OPTI3.NAME INS.OPTI2.NAME "DIMM Seeing-avg"
2015-08-10 HD175743 284.025323 18.10491 "18:56:06.08 +18:06:17.7" "49.647892 7.151299" 091.C-0597(A) PIONI.2013-08-10T01:18:09.868 200280739 SCIENCE OBJECT INTERFEROMETRY ESO-VLTI-A1234 SMALL H "2.12 [1.55]"
2013-08-08 "" "" "" "" "" 60.A-9209(A) PIONI.2013-08-08T19:12:08.961 -1 CALIB OBJECT INTERFEROMETRY NOT_SPECIFIED LARGE K N/A
2015-08-10 HD902 3.307454 -37.82288 "00:13:13.79 -37:49:22.4" "337.453945 -76.626611" 091.C-0597(A) PIONI.2013-08-10T04:48:41.421 200280783 SCIENCE OBJECT INTERFEROMETRY ESO-VLTI-A1234 SMALL H "1.89 [1.30]"
2015-08-10 HD12685 30.974513 -17.51381 "02:03:53.88 -17:30:49.7" "186.800007 -70.714711" 091.C-0597(A) PIONI.2013-08-10T05:39:01.876 200280795 SCIENCE OBJECT INTERFEROMETRY ESO-VLTI-A1234 SMALL H "1.74 [1.14]"
2015-08-10 HD172555 281.362314 -64.87171 "18:45:26.96 -64:52:18.2" "330.566195 -23.763089" 091.C-0597(A) PIONI.2013-08-10T00:56:53.207 200280733 SCIENCE OBJECT INTERFEROMETRY ESO-VLTI-A1234 SMALL H "1.82 [1.24]"
2015-08-10 HD12851 30.657134 -70.41939 "02:02:37.71 -70:25:09.8" "294.523968 -45.529034" 091.C-0597(A) PIONI.2013-08-10T07:03:45.758 200280819 SCIENCE OBJECT INTERFEROMETRY ESO-VLTI-A1234 SMALL H "1.56 [0.94]"
2015-08-10 HD172555 281.362314 -64.87171 "18:45:26.96 -64:52:18.2" "330.566195 -23.763089" 091.C-0597(A) PIONI.2013-08-10T00:39:56.695 200280729 SCIENCE OBJECT INTERFEROMETRY ESO-VLTI-A1234 SMALL H "2.00 [1.41]"
2015-08-10 HD210302 332.538122 -32.54837 "22:10:09.15 -32:32:54.1" "14.123751 -54.815492" 091.C-0597(A) PIONI.2013-08-10T03:09:17.285 200280763 SCIENCE OBJECT INTERFEROMETRY ESO-VLTI-A1234 SMALL H "1.69 [1.09]"
2013-08-10 DARK 267.489192 -24.20715 "17:49:57.41 -24:12:25.7" "4.549806 1.615019" 091.C-0597(A) PIONI.2013-08-10T00:12:15.215 200280721 CALIB DARK INTERFEROMETRY ESO-VLTI-A1234 SMALL H "2.12 [1.55]"
2015-08-10 HD20794 49.994433 -43.06758 "03:19:58.66 -43:04:03.3" "250.737904 -56.068709" 091.C-0597(A) PIONI.2013-08-10T07:49:05.312 200280831 SCIENCE OBJECT INTERFEROMETRY ESO-VLTI-A1234 SMALL H "1.20 [0.49]"
2015-08-10 HD157398 261.014635 -23.84439 "17:24:03.51 -23:50:39.8" "1.691813 6.809025" 091.C-0597(A) PIONI.2013-08-09T23:55:43.057 200280717 SCIENCE OBJECT INTERFEROMETRY ESO-VLTI-A1234 SMALL H "2.29 [1.72]"
2015-08-10 HD20794 49.994401 -43.06758 "03:19:58.66 -43:04:03.3" "250.737915 -56.068731" 091.C-0597(A) PIONI.2013-08-10T08:18:11.502 200280837 SCIENCE OBJECT INTERFEROMETRY ESO-VLTI-A1234 SMALL H "1.29 [0.62]"
2013-08-10 DARK 30.974463 -17.5137 "02:03:53.87 -17:30:49.3" "186.799649 -70.714691" 091.C-0597(A) PIONI.2013-08-10T06:11:24.239 200280805 CALIB DARK INTERFEROMETRY ESO-VLTI-A1234 SMALL H "1.82 [1.24]"
2015-08-10 HD12702 31.052092 -11.85978 "02:04:12.50 -11:51:35.2" "174.663205 -67.096772" 091.C-0597(A) PIONI.2013-08-10T05:53:59.116 200280799 SCIENCE OBJECT INTERFEROMETRY ESO-VLTI-A1234 SMALL H "1.65 [1.04]"
2013-08-08 DARK "" "" "" "" 60.A-9209(A) PIONI.2013-08-08T19:40:36.528 -1 CALIB DARK INTERFEROMETRY NOT_SPECIFIED LARGE K N/A
2015-08-10 HD7788 18.945799 -68.87554 "01:15:46.99 -68:52:31.9" "299.652085 -48.097459" 091.C-0597(A) PIONI.2013-08-10T06:43:00.613 200280813 SCIENCE OBJECT INTERFEROMETRY ESO-VLTI-A1234 SMALL H "1.61 [0.99]"
2013-08-10 DARK 50.278513 3.67554 "03:21:06.84 +03:40:31.9" "178.323155 -42.543848" 091.C-0597(A) PIONI.2013-08-10T09:17:08.888 200280851 CALIB DARK INTERFEROMETRY ESO-VLTI-A1234 SMALL H "1.89 [1.32]"
2015-08-10 HD2262 6.551286 -43.67973 "00:26:12.31 -43:40:47.0" "318.414867 -72.682018" 091.C-0597(A) PIONI.2013-08-10T04:40:22.433 200280781 SCIENCE OBJECT INTERFEROMETRY ESO-VLTI-A1234 SMALL H "1.84 [1.25]"
2013-08-22 DARK "" "" "" "" 60.A-9209(A) PIONI.2013-08-22T00:42:54.170 -1 CALIB DARK INTERFEROMETRY NOT_SPECIFIED SMALL H "0.92 [0.01]"
2015-08-10 HD10700 26.011563 -15.9349 "01:44:02.78 -15:56:05.6" "173.081094 -73.441601" 091.C-0597(A) PIONI.2013-08-10T06:03:46.335 200280801 SCIENCE OBJECT INTERFEROMETRY ESO-VLTI-A1234 SMALL H "1.59 [0.97]"
2015-08-10 HD158643 262.853992 -23.96272 "17:31:24.96 -23:57:45.8" "2.520365 5.338331" 091.C-0597(A) PIONI.2013-08-09T23:49:45.437 200280715 SCIENCE OBJECT INTERFEROMETRY ESO-VLTI-A1234 SMALL H "1.81 [1.21]"
2015-08-10 HD8705 21.405239 -14.59885 "01:25:37.26 -14:35:55.9" "157.075939 -75.155006" 091.C-0597(A) PIONI.2013-08-10T06:23:26.919 200280809 SCIENCE OBJECT INTERFEROMETRY ESO-VLTI-A1234 SMALL H "1.89 [1.31]"
2015-08-10 HD164871 271.951435 -64.55035 "18:07:48.34 -64:33:01.3" "329.584273 -19.838288" 091.C-0597(A) PIONI.2013-08-10T00:35:28.342 200280727 SCIENCE OBJECT INTERFEROMETRY ESO-VLTI-A1234 SMALL H "2.62 [2.06]"
2013-08-10 KAPPA 284.025328 18.10492 "18:56:06.08 +18:06:17.7" "49.647903 7.151299" 091.C-0597(A) PIONI.2013-08-10T03:43:32.649 200280767 CALIB KAPPA INTERFEROMETRY ESO-VLTI-A1234 SMALL H "1.68 [1.07]"
2015-08-10 HD175743 284.025354 18.10493 "18:56:06.08 +18:06:17.7" "49.647923 7.151281" 091.C-0597(A) PIONI.2013-08-10T01:55:35.177 200280747 SCIENCE OBJECT INTERFEROMETRY ESO-VLTI-A1234 SMALL H "2.12 [1.55]"
2013-08-10 DARK 339.992402 -35.17482 "22:39:58.18 -35:10:29.4" "8.702179 -60.892576" 091.C-0597(A) PIONI.2013-08-10T02:28:45.509 200280753 CALIB DARK INTERFEROMETRY ESO-VLTI-A1234 SMALL H "2.22 [1.65]"
2013-08-08 "" "" "" "" "" 60.A-9209(A) PIONI.2013-08-08T19:29:57.421 -1 CALIB OBJECT INTERFEROMETRY NOT_SPECIFIED LARGE K N/A
2013-08-08 "" "" "" "" "" 60.A-9209(A) PIONI.2013-08-08T19:31:37.680 -1 CALIB OBJECT INTERFEROMETRY NOT_SPECIFIED LARGE K N/A
2015-08-10 HD37877 84.607142 -54.95419 "05:38:25.71 -54:57:15.1" "262.788626 -32.233909" 091.C-0597(A) PIONI.2013-08-10T09:42:16.955 200280857 SCIENCE OBJECT INTERFEROMETRY ESO-VLTI-A1234 SMALL H "2.23 [1.69]"
2015-08-10 HD214623 339.992445 -35.17481 "22:39:58.19 -35:10:29.3" "8.702191 -60.892612" 091.C-0597(A) PIONI.2013-08-10T03:01:04.753 200280761 SCIENCE OBJECT INTERFEROMETRY ESO-VLTI-A1234 SMALL H "1.95 [1.37]"
2013-08-10 DARK 284.025354 18.10493 "18:56:06.08 +18:06:17.7" "49.647923 7.151281" 091.C-0597(A) PIONI.2013-08-10T01:56:19.543 200280747 CALIB DARK INTERFEROMETRY ESO-VLTI-A1234 SMALL H "2.17 [1.60]"
2015-08-10 HD19141 45.732881 -46.97503 "03:02:55.89 -46:58:30.1" "259.362724 -57.497310" 091.C-0597(A) PIONI.2013-08-10T07:42:13.911 200280829 SCIENCE OBJECT INTERFEROMETRY ESO-VLTI-A1234 SMALL H "1.47 [0.83]"
2015-08-10 HD10700 30.974463 -17.5137 "02:03:53.87 -17:30:49.3" "186.799649 -70.714691" 091.C-0597(A) PIONI.2013-08-10T06:16:17.826 200280807 SCIENCE OBJECT INTERFEROMETRY ESO-VLTI-A1234 SMALL H "2.03 [1.45]"
2013-08-10 KAPPA 49.360723 -47.75157 "03:17:26.57 -47:45:05.7" "258.807992 -54.939019" 091.C-0597(A) PIONI.2013-08-10T07:30:31.670 200280825 CALIB KAPPA INTERFEROMETRY ESO-VLTI-A1234 SMALL H "1.60 [0.98]"
2013-08-10 DARK 46.158649 1.86359 "03:04:38.08 +01:51:48.9" "176.174511 -46.772773" 091.C-0597(A) PIONI.2013-08-10T09:03:22.770 200280847 CALIB DARK INTERFEROMETRY ESO-VLTI-A1234 SMALL H "2.19 [1.65]"
2015-08-10 HD8705 21.405239 -14.59885 "01:25:37.26 -14:35:55.9" "157.075939 -75.155006" 091.C-0597(A) PIONI.2013-08-10T06:24:54.888 200280809 SCIENCE OBJECT INTERFEROMETRY ESO-VLTI-A1234 SMALL H "1.86 [1.26]"
2015-08-10 HD20640 49.360723 -47.75157 "03:17:26.57 -47:45:05.7" "258.807992 -54.939019" 091.C-0597(A) PIONI.2013-08-10T07:27:48.543 200280825 SCIENCE OBJECT INTERFEROMETRY ESO-VLTI-A1234 SMALL H "1.50 [0.86]"
2015-08-10 HD184722 293.781656 19.00494 "19:35:07.60 +19:00:17.8" "54.742295 -0.627230" 091.C-0597(A) PIONI.2013-08-10T04:19:17.322 200280777 SCIENCE OBJECT INTERFEROMETRY ESO-VLTI-A1234 SMALL H "1.54 [0.92]"
2015-08-10 HD20794 49.994401 -43.06758 "03:19:58.66 -43:04:03.3" "250.737915 -56.068731" 091.C-0597(A) PIONI.2013-08-10T08:18:55.999 200280837 SCIENCE OBJECT INTERFEROMETRY ESO-VLTI-A1234 SMALL H "1.29 [0.62]"
2015-08-10 HD19141 45.732881 -46.97503 "03:02:55.89 -46:58:30.1" "259.362724 -57.497310" 091.C-0597(A) PIONI.2013-08-10T07:44:26.004 200280829 SCIENCE OBJECT INTERFEROMETRY ESO-VLTI-A1234 SMALL H "1.48 [0.84]"
2015-08-10 HD37877 84.607142 -54.95419 "05:38:25.71 -54:57:15.1" "262.788626 -32.233909" 091.C-0597(A) PIONI.2013-08-10T09:45:13.051 200280857 SCIENCE OBJECT INTERFEROMETRY ESO-VLTI-A1234 SMALL H "2.14 [1.59]"
2015-08-10 HD10700 30.974463 -17.5137 "02:03:53.87 -17:30:49.3" "186.799649 -70.714691" 091.C-0597(A) PIONI.2013-08-10T06:14:05.898 200280807 SCIENCE OBJECT INTERFEROMETRY ESO-VLTI-A1234 SMALL H "2.03 [1.45]"
2015-08-10 HD177724 286.35248 13.8632 "19:05:24.60 +13:51:47.5" "46.854133 3.245371" 091.C-0597(A) PIONI.2013-08-10T03:50:57.987 200280769 SCIENCE OBJECT INTERFEROMETRY ESO-VLTI-A1234 SMALL H "1.61 [1.00]"
2013-08-10 DARK 293.781656 19.00494 "19:35:07.60 +19:00:17.8" "54.742295 -0.627230" 091.C-0597(A) PIONI.2013-08-10T04:22:13.976 200280777 CALIB DARK INTERFEROMETRY ESO-VLTI-A1234 SMALL H "1.53 [0.91]"
2013-08-10 KAPPA 30.657077 -70.41939 "02:02:37.70 -70:25:09.8" "294.523993 -45.529041" 091.C-0597(A) PIONI.2013-08-10T06:36:35.223 200280811 CALIB KAPPA INTERFEROMETRY ESO-VLTI-A1234 SMALL H "1.60 [0.98]"
2013-08-08 "" "" "" "" "" 60.A-9209(A) PIONI.2013-08-08T19:18:08.135 -1 CALIB OBJECT INTERFEROMETRY NOT_SPECIFIED LARGE K N/A
2015-08-10 HD177724 286.352482 13.8632 "19:05:24.60 +13:51:47.5" "46.854134 3.245369" 091.C-0597(A) PIONI.2013-08-10T04:07:22.628 200280773 SCIENCE OBJECT INTERFEROMETRY ESO-VLTI-A1234 SMALL H "1.65 [1.04]"
2015-08-10 HD156061 259.115433 -25.30547 "17:16:27.70 -25:18:19.7" "359.495447 7.415272" 091.C-0597(A) PIONI.2013-08-09T23:41:01.141 200280713 SCIENCE OBJECT INTERFEROMETRY ESO-VLTI-A1234 SMALL H "1.81 [1.21]"
2015-08-10 HD8705 21.405239 -14.59885 "01:25:37.26 -14:35:55.9" "157.075939 -75.155006" 091.C-0597(A) PIONI.2013-08-10T06:24:10.915 200280809 SCIENCE OBJECT INTERFEROMETRY ESO-VLTI-A1234 SMALL H "1.83 [1.24]"
2015-08-10 HD20794 49.994426 -43.06758 "03:19:58.66 -43:04:03.3" "250.737906 -56.068714" 091.C-0597(A) PIONI.2013-08-10T07:36:39.996 200280827 SCIENCE OBJECT INTERFEROMETRY ESO-VLTI-A1234 SMALL H "1.36 [0.70]"
