#key;value
identifier:DOI;10.5072/EMAA_para-NH3_Rotation-hot_9da5b297
resourceType:Dataset;EMAA File
publicationYear;2023
date:Collected;2023-11-14
title;Rotation-hot excitation of para-NH3 by ortho-H2 and para-H2 collisions
description:Abstract;62 rotation-hot energy levels / 133 radiative transitions / 1891 collisional transitions for ortho-H2 (5 temperatures in the range 100-500K) / 1891 collisional transitions for para-H2 (5 temperatures in the range 100-500K)
relatedIdentifier:References:DOI;10.1016/S0022-4073(98)00091-0
relatedIdentifier:References:DOI;10.1093/mnras/stad1970
relatedIdentifier:IsPartOf:DOI;10.5072/EMAA
subject:main;target para-NH3
subject:main;excitationType Rotation-hot
subject:main;collisional excitation
subject:var;collider.0 ortho-H2
subject:var;collider.1 para-H2
subject:var;astrophysics
subject:var;interstellar medium
subject:var;comets
subject:var;circumstellar medium
subject:var;gas
subject:var;microwave spectroscopy
subject:var;infrared spectroscopy
subject:var;rotational excitation
subject:var;rovibrational excitation
subject:var;vibrational excitation
subject:var;electronic excitation
subject:var;collisional rate coefficients
subject:var;fine structure
subject:var;hyperfine structure
format;Radex
publisher;UGA, CNRS, CNRS-INSU, OSUG
creatorName;EMAA
language;en
contributorName:ContactPerson;contact@emaa.osug.fr
contributorName:Distributor;Institut de Planétologie et d'Astrophysique de Grenoble (France) - IPAG
contributorName:Distributor;Observatoire des Sciences de l'Univers de Grenoble (France) - OSUG
contributorName:Distributor;OSUG Data Center (France)
contributorName:HostingInstitution;Université Grenoble Alpes (France) - UGA
contributorName:Sponsor;Programme National de Physique et Chimie du Milieu Interstellaire - INSU/CNRS (PCMI)
contributorName:Sponsor;Institut National des Sciences de l'Univers - INSU
contributorName:DataManager;Raphaël Jacquot;affiliation;IR/OSUG;nameIdentifier:ORCID;0000-0001-6345-2774
contributorName:DataCurator;Alexandre Faure;affiliation;DR/IPAG;nameIdentifier:ORCID;0000-0001-7199-2535
contributorName:DataCurator;Aurore Bacmann;affiliation;Astron/IPAG;nameIdentifier:ORCID;0000-0003-1263-4986
contributorName:ProjectLeader;Alexandre Faure;affiliation;DR/IPAG;nameIdentifier:ORCID;0000-0001-7199-2535
contributorName:ProjectLeader;Aurore Bacmann;affiliation;Astron/IPAG;nameIdentifier:ORCID;0000-0003-1263-4986
contributorName:ProjectLeader;Bernard Boutherin;affiliation;CNRS/IPAG;nameIdentifier:ORCID;0000-0002-0860-0698
funderName;Institut de Planétologie et d’Astrophysique de Grenoble (France) - IPAG
funderName;Institut de Sciences de l'Univers (France) - INSU
funderName;Centre National de la Recherche Scientifique (France) - CNRS
funderName;Observatoire des Sciences de l'Univers de Grenoble (France) - OSUG
funderName;Université Grenoble Alpes (France) - UGA 
funderName;European Commission
rights;"Please acknowledge the use of EMAA Database by citing the original articles in which the data were published (BibTeX format available), and adding the following sentence in your publication: 
This research has made use of spectroscopic and collisional data from the EMAA database (https://emaa.osug.fr). EMAA is supported by the Observatoire des Sciences de l'Univers de Grenoble (OSUG)"
rights;Licence: CC BY 4.0;rightsURI;https://creativecommons.org/licenses/by/4.0
rights;Data access and use are ruled by the EMAA data policy.;rightsURI;https://emaa.osug.fr
relatedIdentifier:Cites:URL;https://emaa.osug.fr
