# DOI_suffix;data_access_url
OHMCV.DSD.PVI.11-14.1;https://ohm-cv.osug.fr/download:436
OHMCV.DSD.PVI.12-16.1;https://ohm-cv.osug.fr/download:733
OHMCV.DSD.MRE.12-14.1;https://ohm-cv.osug.fr/download:679
OHMCV.DSD.MRE.12-16.1;https://ohm-cv.osug.fr/download:708
OHMCV.DSD.SEF.12-14.1;https://ohm-cv.osug.fr/download:744
OHMCV.DSD.SEF.12-16.1;https://ohm-cv.osug.fr/download:784
OHMCV.DSD.VB1.12-14.1;https://ohm-cv.osug.fr/download:680
OHMCV.DSD.VB1.12-16.1;https://ohm-cv.osug.fr/download:705
OHMCV.DSD.VB2.11-14.1;https://ohm-cv.osug.fr/download:681
OHMCV.DSD.VB2.12-16.1;https://ohm-cv.osug.fr/download:751
OHMCV.DSD.VB3.12-14.1;https://ohm-cv.osug.fr/download:682
OHMCV.DSD.VB3.12-16.1;https://ohm-cv.osug.fr/download:752
OHMCV.RTS.AUZ.10-14.1;https://ohm-cv.osug.fr/download:656
OHMCV.REA.CEV.07-14.1;https://ohm-cv.osug.fr/download:1183
OHMCV.HSS.CLA.11-14.1;https://ohm-cv.osug.fr/download:993
OHMCV.ADV.CLA.13-14.1;https://ohm-cv.osug.fr/download:1349
OHMCV.ERO.PRA.10-13.1;https://ohm-cv.osug.fr/download:1347
OHMCV.LIM.CLA.12-14.1;https://ohm-cv.osug.fr/download:994
OHMCV.SMO.CLA.13-14.1;https://ohm-cv.osug.fr/download:1350
OHMCV.DSD.SOU.12-16.1;https://ohm-cv.osug.fr/download:785
OHMCV.DSD.ALE.12-16.1;https://ohm-cv.osug.fr/download:781
OHMCV.DSD.VAL.12-16.1;https://ohm-cv.osug.fr/download:782
OHMCV.DSD.TOU.12-16.1;https://ohm-cv.osug.fr/download:783
