"# Clé";Valeur;"# Clé attribut";"# Valeur attribut";"# Clé attribut";"# Valeur attribut";"# Description"
identifier:DOI;10.5072/ZAA_SOIL_TEMP.BIOCLIM;;;;;"# 1. Identifier: Identifiant DOI au format 10.5072/<suffixe>"
title;"Long term monitoring of near surface soil temperature in the french Alps";;;;;"# 3. Title: Titre du service / jeu de données (citation)"
title:AlternativeTitle;;;;;;"# Titre long (sigles développés)"
title:Subtitle;;;;;;
title:TranslatedTitle;;;;;;"# Titre original (FR)"
publisher;"UGA – OSUG – CNRS";;;;;"# 4. Publisher: Lister les tutelles impliquées dans le jeu de données (contributeurs majeurs, sigles uniquement) séparées par des virgules"
"# 7. Contributor";;;;;;"# 7. Contributor: Lister les personnes / institutions associées au jeu de données / service d'observation: utiliser autant de lignes que nécessaire et remplir les attributs affiliation et identifiant ORCID pour les personnes"
contributorName:ContactPerson;;;;;;
contributorName:DataCollector;;affiliation;;nameIdentifier:ORCID;;"# Nom des personnes de terrain chargées de la collecte des données"
contributorName:DataCurator;;affiliation;;nameIdentifier:ORCID;;"# Nom des personnes chargées de la validation des données et meta données"
contributorName:DataManager;;affiliation;;nameIdentifier:ORCID;;"# Nom des personnes ou équipe chargés de la disponibilité / mise à jour des données, logiciels, machines"
contributorName:ProjectLeader;"Philippe CHOLER";affiliation;"CNRS, LECA";nameIdentifier:ORCID;0000-0002-9062-2721;"# Responsable du SO (PI)"
contributorName:ProjectManager;"Lucie LIGER";affiliation;"CNRS, Jardin du Lautaret";nameIdentifier:ORCID;0000-0002-2238-1065;"# Responsable technique (instrument, site …) si pertinent"
contributorName:ProjectMember;;affiliation;;nameIdentifier:ORCID;;"# Liste des personnes du projet"
contributorName:RelatedPerson;;affiliation;;nameIdentifier:ORCID;;"# Autre ?"
contributorName:ResearchGroup;"LECA, Jardin du Lautaret";affiliation;;nameIdentifier:ORCID;;"# Equipes et Laboratoires de recherche"
contributorName:Sponsor;;;;;;"# Financement ponctuel ou en personnel (exceptionel)"
contributorName:WorkPackageLeader;"Lucie LIGER";affiliation;"CNRS, Jardin du Lautaret";nameIdentifier:ORCID;0000-0002-2238-1065;"# Responsable du dataset (data PI)"
date:Collected;1999-05-29/2020-09-16;;;;;"# 8. Date: Donner la date de début (et de fin) de collecte des données [dateType=Collected]"
description:Abstract;"Monitoring of near-surface soil temperature in seasonaly snow-covered, mountain ecosystems located in the Lautaret-Galibier area of the French Alps. Data are part of a long-term monitoring programs examining the impact of climate change on snow cover dynamics, microclimate, species distribution and ecosystem functioning. Data include a GPS position, a date and time in UTC and a near-surface soil temperature (in °C) measured at 5 cm belowground using stand-alone temperature data logger.";;;;;"# 17. Description: description textuelle du jeu de données / service"
geoLocationPlace;"France, alps";;;;;"# 18. GeoLocation: nom d'une zone géographique"
geoLocationPolygon;"6.364962890212729 45.108925193711315,6.475856139724447 45.108925193711315,6.475856139724447 45.051470284744155,6.364962890212729 45.051470284744155,6.364962890212729 45.108925193711315";;;;;"# 18. GeoLocation: bounding box au format ‘S W N E’"
relatedIdentifier:IsPartOf:DOI;10.5072/ZAA_SOIL_TEMP.all;;;;;"# Lien vers le DOI parent"
