identifier:DOI;10.5072/CRYOBSCLIM.CLB.SAFRAN;;;;
title;"Col du Lac Blanc, SAFRAN meteorological data";;;;
publicationYear;2000;;;;
subject:main;"SAFRAN air temperature (K)";;;;
subject:main;"SAFRAN specific humidity (kg/kg)";;;;
subject:main;"SAFRAN wind speed (m/s)";;;;
subject:main;"SAFRAN wind direction (deg)";;;;
subject:main;"SAFRAN downward longwave radiation (W/m²)";;;;
subject:main;"SAFRAN downward direct shortwave radiation (W/m2)";;;;
subject:main;"SAFRAN downward diffuse shortwave radiation (W/m2)";;;;
subject:main;"SAFRAN nebulosity (-)";;;;
subject:main;"SAFRAN rainfall rate (kg/m2/s)";;;;
subject:main;"SAFRAN snowfall rate (kg/m2/s)";;;;
contributorName:WorkPackageLeader;"Hugo Merzisen";affiliation;CNRM/CEN;nameIdentifier:ORCID;
contributorName:DataManager;"Yannick Deliot";affiliation;CNRM/CEN;nameIdentifier:ORCID;0000-0003-2043-9814
date:Collected;2000-08-01/2020-03-31;;;;
description:SeriesInformation;"This data set contains continuous hourly meteorological output of the SAFRAN meteorological analysis system (Durand et al., Annals of Glaciology, 1993) at the elevation of Col du Lac Blanc in the Grandes Rousses range from August 1st 2000 to August 1st 2016.
Data are available in a csv format (separator «;») and are organized in 11 columns :
C1 : Date (UTC) : date (format year/month/day hour:minute)
C2 : Air Temp (K) : air temperature (K)
C3 : Specific Hum. (kg/kg) : specific Humidity (kg/kg)
C4 : Avg Wind Speed (m/s) : mean wind speed (m/s)
C5 : Wind Dir (deg)
C6 : Down Longwave Rad (W/m²) : downward longwave radiation (W/m²)
C7 : Down direct Shortwave Rad (W/m²) : downward direct shortwave radiation (W/m²)
C8 : Down diffuse Shortwave Rad. (W/m²) : downward diffuse shortwave radiation (W/m²)
C9 : Nebulosity (-) : nebulosity (-)
C10 : Rainfall rate (kg/m²/s) : rainfall rate (kg/m²/s)
C11 : Snowfall rate (kg/m²/s) : snowfall rate (kg/m²/s)
SAFRAN data at Col du Lac Blanc are provided to get all the meteorological parameters required to run continuously a land surface model without the need to restart the system every winter. It is recommended to replace SAFRAN wind speed and direction by the observations collected at Col du Lac Blanc when running a land surface scheme at Col du Lac Blanc in wintertime as described in Vionnet et al. (Advances in Water Resources, 2013).";;;;
geoLocationPlace;"Col du Lac Blanc";;;;
geoLocationPoint;"45.128329 6.112053";;;;
"# END";;;;;
