"# Clé";Valeur
identifier:DOI;10.5072/DRAIXBLEONE_GAL_ROB_COND_1719
title;"Electrical conductivity of the river Galabre at the Robine station of the Galabre watershed"
title:TranslatedTitle;"Mesures de conductivités électriques acquises sur le site de la Robine sur Galabre au niveau de l'exutoire du bassin versant du Galabre de l'Observatoire Draix Bleone"
subject:var;"Surface water"
subject:var;Hydrology
subject:var;"Water quality / Water chemistry"
contributorName:DataCollector;"Romain Biron"
contributorName:DataCollector;"Guilhem Freche"
contributorName:DataCollector;"Cédric Legoût"
date:Collected;"2017-01-01 /"
resourceType:Dataset;"Electrical conductivity at the outlet of a mesoscale mediterranean mountainous watershed "
relatedIdentifier:Cites:URL;https://bdoh.irstea.fr/DRAIX/GALABRE/COND
description:Abstract;"This conductivity data set is part of the DRAIXBLEONE_GAL observatory."
geoLocationPoint;"44.174 6.219"
description:SeriesInformation;"This data set contains electrical conductivity data acquired in the river Galabre at the Robine site, corresponding to the outlet of the Galabre watershed. Files are in CSV format containing date and hour in UTC and conductivity in µS/cm (COND)."
