"# Clé";"# Valeur";"# Clé (affiliation/rightsURI)";"# Valeur attribut";"# Clé (nameIdentifier:ORCID)";"# Valeur attribut"
publisher;"CNRS, OSUG, ISTERRE";;;;
subject:main;"GNSS products";;;;
subject:var;"GNSS data analysis";;;;
subject:var;"Position time series";;;;
contributorName:ContactPerson;anne.socquet@univ-grenoble-alpes.fr;affiliation;UGA;nameIdentifier:ORCID;0000-0002-9208-7136
contributorName:ContactPerson;gael.janex@univ-grenoble-alpes.fr;affiliation;CNRS;;
contributorName:DataManager;"Gaël Janex";affiliation;CNRS;;
contributorName:Distributor;"Institut des Sciences de la Terre (France) - ISTerre";;;;
contributorName:Distributor;"OSUG Data Center (France)";;;;
contributorName:Distributor;"Centre National de la Recherche Scientifique (France) - CNRS";;;;
contributorName:HostingInstitution;"Université Grenoble Alpes (France) - UGA";;;;
contributorName:Funder;"Centre National de la Recherche Scientifique (France) - CNRS, Institut des Sciences de l'Univers (France) - INSU";;;;
contributorName:Funder;"Observatoire des Sciences de l'Univers de Grenoble (France) - OSUG";;;;
contributorName:Funder;"REseau SIsmologique & géodésique Français (France) - RESIF";;;;
contributorName:ProjectLeader;"Anne Socquet";affiliation;UGA;nameIdentifier:ORCID;0000-0002-9208-7136
contributorName:ResearchGroup;"Institut des Sciences de la Terre (France) - ISTerre";;;;
contributorName:DataCollector;"Anne Socquet";affiliation;UGA;nameIdentifier:ORCID;0000-0002-9208-7136
contributorName:DataCollector;"Gaël Janex";affiliation;CNRS;;
language;en;;;;
format;pos;;;;
format;PBO;;;;
rights;"License: CC BY-NC-ND 4.0";rightsURI;https://www.creativecommons.org/licenses/by-nc-nd/4.0/;;
rights;"Data access and use are ruled by the OSUG data policy.";;;;
rights;"The following acknowledging sentence should appear in publications using ISTerre GNSS products: ""GNSS products are calculated and provided by the Institut of Sciences de la Terre (ISTerre), belonging to the Institut National des Sciences de l’Univers (INSU/CNRS) and the Observatoire des Sciences de l’Univers de Grenoble (OSUG / Université Grenoble Alpes)"". 
You are invited to contact the PI(s) or lead scientist for more information about the data and to include the acknowledgement sentence in any publication using the data.";;;;
