"# Clé";Valeur;affiliation;Valeur;nameIdentifier:ORCID;Valeur
identifier:DOI;10.5072/CRYOBSCLIM.CDP.2018.SolarMask;;;;
title;"Col de Porte, Solar Mask";;;;
publicationYear;1998;;;;
subject:main;"Solar Mask";;;;
contributorName:WorkPackageLeader;"Pierre Spandre";;;;
date:Collected;1998-07-01;;;;
date:Collected;2018-06-20;;;;
format;CSV;;;;
description:SeriesInformation;"This dataset contains solar mask measured at location 31 close to the radiations measurements sensors in July 1998 and June 2018. 
Data are available in a csv format (tab separator) and are organized in 8 lines:  
L1 : Azimuth for July 1998 in degrees from North
L2 : Upper elevation of the mask in degrees for July 1998
L3 : Lower elevation of the mask in degrees for July 1998
L4 : Percentage of occultation between the lower and upper elevation for July 1998
L5 : Azimuth for June 2018 in degrees from North
L6 : Upper elevation of the mask in degrees for June 2018
L7 : Lower elevation of the mask in degrees for June 2018
L8 : Percentage of occultation between the lower and upper elevation for June 2018
A full description of the data is available in Lejeune et al. (ESSD, 2018).";;;;
