#key;value
identifier:DOI;10.5072/EMAA_H2_Rovibration_5e046bb5
resourceType:Dataset;EMAA File
publicationYear;2021
date:Collected;2021-09-14
title;Rovibration excitation of H2 by H and H+ collisions
description:Abstract;54 rovibration energy levels / 226 radiative transitions / 1431 collisional transitions for H (50 temperatures in the range 100-5000K) / 325 collisional transitions for H+ (26 temperatures in the range 5-3000K)
relatedIdentifier:References:DOI;10.1051/0004-6361/201936249
relatedIdentifier:References:DOI;10.1093/mnras/stv1683
relatedIdentifier:References:DOI;10.1063/5.0039629
relatedIdentifier:IsPartOf:DOI;10.5072/EMAA
subject:main;target H2
subject:main;excitationType Rovibration
subject:main;collisional excitation
subject:var;collider.0 H
subject:var;collider.1 H+
subject:var;astrophysics
subject:var;interstellar medium
subject:var;comets
subject:var;circumstellar medium
subject:var;gas
subject:var;microwave spectroscopy
subject:var;infrared spectroscopy
subject:var;rotational excitation
subject:var;rovibrational excitation
subject:var;vibrational excitation
subject:var;electronic excitation
subject:var;collisional rate coefficients
subject:var;fine structure
subject:var;hyperfine structure
format;Radex
publisher;UGA, CNRS, CNRS-INSU, OSUG
creatorName;EMAA
language;en
contributorName:ContactPerson;contact@emaa.osug.fr
contributorName:Distributor;Institut de Planétologie et d'Astrophysique de Grenoble (France) - IPAG
contributorName:Distributor;Observatoire des Sciences de l'Univers de Grenoble (France) - OSUG
contributorName:Distributor;OSUG Data Center (France)
contributorName:HostingInstitution;Université Grenoble Alpes (France) - UGA
contributorName:Sponsor;Programme National de Physique et Chimie du Milieu Interstellaire - INSU/CNRS (PCMI)
contributorName:Sponsor;Institut National des Sciences de l'Univers - INSU
contributorName:DataManager;Raphaël Jacquot;affiliation;IR/OSUG;nameIdentifier:ORCID;0000-0001-6345-2774
contributorName:DataCurator;Alexandre Faure;affiliation;DR/IPAG;nameIdentifier:ORCID;0000-0001-7199-2535
contributorName:DataCurator;Aurore Bacmann;affiliation;Astron/IPAG;nameIdentifier:ORCID;0000-0003-1263-4986
contributorName:ProjectLeader;Alexandre Faure;affiliation;DR/IPAG;nameIdentifier:ORCID;0000-0001-7199-2535
contributorName:ProjectLeader;Aurore Bacmann;affiliation;Astron/IPAG;nameIdentifier:ORCID;0000-0003-1263-4986
contributorName:ProjectLeader;Bernard Boutherin;affiliation;CNRS/IPAG;nameIdentifier:ORCID;0000-0002-0860-0698
funderName;Institut de Planétologie et d’Astrophysique de Grenoble (France) - IPAG
funderName;Institut de Sciences de l'Univers (France) - INSU
funderName;Centre National de la Recherche Scientifique (France) - CNRS
funderName;Observatoire des Sciences de l'Univers de Grenoble (France) - OSUG
funderName;Université Grenoble Alpes (France) - UGA 
funderName;European Commission
rights;"Please acknowledge the use of EMAA Database by citing the original articles in which the data were published (BibTeX format available), and adding the following sentence in your publication: 
This research has made use of spectroscopic and collisional data from the EMAA database (https://emaa.osug.fr). EMAA is supported by the Observatoire des Sciences de l'Univers de Grenoble (OSUG)"
rights;Licence: CC BY 4.0;rightsURI;https://creativecommons.org/licenses/by/4.0
rights;Data access and use are ruled by the EMAA data policy.;rightsURI;https://emaa.osug.fr
relatedIdentifier:Cites:URL;https://emaa.osug.fr
