# Object 3D file generated by CamiTK
# number of vertices : 1542
# number of faces : 3080
v 81.8125 141.625 318.008
v 81.8125 140.94 320
v 81.1277 141.625 320
v 82.5 141.625 318.008
v 82.5 140.94 320
v 83.1875 141.625 318.008
v 83.1875 140.94 320
v 83.875 141.625 318.008
v 83.875 140.94 320
v 84.5598 141.625 320
v 81.125 142.312 318.008
v 81.125 141.628 320
v 80.4402 142.312 320
v 81.8125 142.312 318.008
v 82.5 142.312 318.008
v 83.1875 142.312 318.008
v 83.875 142.312 318.008
v 84.5625 141.628 320
v 84.5625 142.312 318.008
v 85.25 142.312 318.008
v 85.25 141.628 320
v 85.9348 142.312 320
v 81.125 143 318.008
v 80.4402 143 320
v 81.8125 143 318.008
v 82.5 143 318.008
v 83.1875 143 318.008
v 83.875 143 318.008
v 84.5625 143 318.008
v 85.25 143 318.008
v 85.9375 142.315 320
v 85.9375 143 318.008
v 86.625 143 318.008
v 86.625 142.315 320
v 87.3098 143 320
v 81.125 143.688 318.008
v 80.4402 143.688 320
v 81.8125 143.688 318.008
v 82.5 143.688 318.008
v 83.1875 143.688 318.008
v 83.875 143.688 318.008
v 84.5625 143.688 318.008
v 85.25 143.688 318.008
v 85.9375 143.688 318.008
v 86.625 143.688 318.008
v 87.3125 143.003 320
v 87.3125 143.688 318.008
v 87.9973 143.688 320
v 81.125 144.375 318.008
v 80.4402 144.375 320
v 81.8125 144.375 318.008
v 82.5 144.375 318.008
v 83.1875 144.375 318.008
v 83.875 144.375 318.008
v 84.5625 144.375 318.008
v 85.25 144.375 318.008
v 85.9375 144.375 318.008
v 86.625 144.375 318.008
v 87.3125 144.375 318.008
v 88 143.69 320
v 88 144.375 318.008
v 88.6848 144.375 320
v 81.125 145.062 318.008
v 80.4402 145.062 320
v 81.8125 145.062 318.008
v 82.5 145.062 318.008
v 83.1875 145.062 318.008
v 83.875 145.062 318.008
v 84.5625 145.062 318.008
v 85.25 145.062 318.008
v 85.9375 145.062 318.008
v 86.625 145.062 318.008
v 87.3125 145.062 318.008
v 88 145.062 318.008
v 88.6875 144.378 320
v 88.6875 145.062 318.008
v 89.3723 145.062 320
v 81.125 145.747 320
v 81.1277 145.75 320
v 81.8125 145.75 318.008
v 82.5 145.75 318.008
v 83.1875 145.75 318.008
v 83.875 145.75 318.008
v 84.5625 145.75 318.008
v 85.25 145.75 318.008
v 85.9375 145.75 318.008
v 86.625 145.75 318.008
v 87.3125 145.75 318.008
v 88 145.75 318.008
v 88.6875 145.75 318.008
v 89.3723 145.75 320
v 81.8125 146.435 320
v 82.5 146.435 320
v 83.1875 146.435 320
v 83.875 146.435 320
v 83.8777 146.438 320
v 84.5625 146.438 318.008
v 85.25 146.438 318.008
v 85.9375 146.438 318.008
v 86.625 146.438 318.008
v 87.3125 146.438 318.008
v 88 146.438 318.008
v 88.6848 146.438 320
v 88.6875 146.435 320
v 84.5625 147.122 320
v 85.25 147.122 320
v 85.9375 147.122 320
v 86.625 147.122 320
v 87.3125 147.122 320
v 88 147.122 320
v 79.75 139.562 320.008
v 79.75 138.878 322
v 79.0652 139.562 322
v 80.4375 139.562 320.008
v 80.4375 138.878 322
v 81.125 139.562 320.008
v 81.125 138.878 322
v 81.8125 139.562 320.008
v 81.8125 138.878 322
v 82.5 139.562 320.008
v 82.5 138.878 322
v 83.1875 139.562 320.008
v 83.1875 138.878 322
v 83.875 139.562 320.008
v 83.875 138.878 322
v 84.5598 139.562 322
v 79.0625 140.25 320.008
v 79.0625 139.565 322
v 78.3777 140.25 322
v 79.75 140.25 320.008
v 80.4375 140.25 320.008
v 81.125 140.25 320.008
v 81.8125 140.25 320.008
v 82.5 140.25 320.008
v 83.1875 140.25 320.008
v 83.875 140.25 320.008
v 84.5625 139.565 322
v 84.5625 140.25 320.008
v 85.25 140.25 320.008
v 85.25 139.565 322
v 85.9348 140.25 322
v 78.375 140.938 320.008
v 78.375 140.253 322
v 77.6902 140.938 322
v 79.0625 140.938 320.008
v 79.75 140.938 320.008
v 80.4375 140.938 320.008
v 81.125 140.938 320.008
v 81.8125 140.938 320.008
v 82.5 140.938 320.008
v 83.1875 140.938 320.008
v 83.875 140.938 320.008
v 84.5625 140.938 320.008
v 85.25 140.938 320.008
v 85.9375 140.253 322
v 85.9375 140.938 320.008
v 86.625 140.938 320.008
v 86.625 140.253 322
v 87.3098 140.938 322
v 77.6875 141.625 320.008
v 77.6875 140.94 322
v 77.0027 141.625 322
v 78.375 141.625 320.008
v 79.0625 141.625 320.008
v 79.75 141.625 320.008
v 80.4375 141.625 320.008
v 81.125 141.625 320.008
v 84.5625 141.625 320.008
v 85.25 141.625 320.008
v 85.9375 141.625 320.008
v 86.625 141.625 320.008
v 87.3125 140.94 322
v 87.3125 141.625 320.008
v 87.9973 141.625 322
v 77.6875 142.312 320.008
v 77.0027 142.312 322
v 78.375 142.312 320.008
v 79.0625 142.312 320.008
v 79.75 142.312 320.008
v 80.4375 142.312 320.008
v 85.9375 142.312 320.008
v 86.625 142.312 320.008
v 87.3125 142.312 320.008
v 88 141.628 322
v 88 142.312 320.008
v 88.6848 142.312 322
v 77.6875 143 320.008
v 77.0027 143 322
v 78.375 143 320.008
v 79.0625 143 320.008
v 79.75 143 320.008
v 80.4375 143 320.008
v 87.3125 143 320.008
v 88 143 320.008
v 88.6875 142.315 322
v 88.6875 143 320.008
v 89.3723 143 322
v 77.6875 143.685 322
v 77.6902 143.688 322
v 78.375 143.688 320.008
v 79.0625 143.688 320.008
v 79.75 143.688 320.008
v 80.4375 143.688 320.008
v 88 143.688 320.008
v 88.6875 143.688 320.008
v 89.375 143.003 322
v 89.375 143.688 320.008
v 90.0598 143.688 322
v 78.375 144.372 322
v 78.3777 144.375 322
v 79.0625 144.375 320.008
v 79.75 144.375 320.008
v 80.4375 144.375 320.008
v 88.6875 144.375 320.008
v 89.375 144.375 320.008
v 90.0625 143.69 322
v 90.0625 144.375 320.008
v 90.75 144.375 320.008
v 90.75 143.69 322
v 91.4375 144.375 320.008
v 91.4375 143.69 322
v 92.125 144.375 320.008
v 92.125 143.69 322
v 92.8125 144.375 320.008
v 92.8125 143.69 322
v 93.5 144.375 320.008
v 93.5 143.69 322
v 94.1848 144.375 322
v 79.0625 145.062 320.008
v 78.3777 145.062 322
v 79.75 145.062 320.008
v 80.4375 145.062 320.008
v 89.375 145.062 320.008
v 90.0625 145.062 320.008
v 90.75 145.062 320.008
v 91.4375 145.062 320.008
v 92.125 145.062 320.008
v 92.8125 145.062 320.008
v 93.5 145.062 320.008
v 94.1875 144.378 322
v 94.1875 145.062 320.008
v 94.8723 145.062 322
v 79.0625 145.747 322
v 79.0652 145.75 322
v 79.75 145.75 320.008
v 80.4375 145.75 320.008
v 81.125 145.75 320.008
v 89.375 145.75 320.008
v 90.0625 145.75 320.008
v 90.75 145.75 320.008
v 91.4375 145.75 320.008
v 92.125 145.75 320.008
v 92.8125 145.75 320.008
v 93.5 145.75 320.008
v 94.1875 145.75 320.008
v 94.875 145.065 322
v 94.875 145.75 320.008
v 95.5598 145.75 322
v 79.75 146.435 322
v 80.4375 146.435 322
v 80.4402 146.438 322
v 81.125 146.438 320.008
v 81.8125 146.438 320.008
v 82.5 146.438 320.008
v 83.1875 146.438 320.008
v 83.875 146.438 320.008
v 88.6875 146.438 320.008
v 89.375 146.438 320.008
v 90.0625 146.438 320.008
v 90.75 146.438 320.008
v 91.4375 146.438 320.008
v 92.125 146.438 320.008
v 92.8125 146.438 320.008
v 93.5 146.438 320.008
v 94.1875 146.438 320.008
v 94.875 146.438 320.008
v 95.5625 145.753 322
v 95.5625 146.438 320.008
v 96.25 146.438 320.008
v 96.25 145.753 322
v 96.9348 146.438 322
v 101.75 146.438 320.008
v 101.75 145.753 322
v 101.065 146.438 322
v 102.438 146.438 320.008
v 102.438 145.753 322
v 103.125 146.438 320.008
v 103.125 145.753 322
v 103.81 146.438 322
v 81.125 147.122 322
v 81.1277 147.125 322
v 81.8125 147.125 320.008
v 82.5 147.125 320.008
v 83.1875 147.125 320.008
v 83.875 147.125 320.008
v 84.5625 147.125 320.008
v 85.25 147.125 320.008
v 85.9375 147.125 320.008
v 86.625 147.125 320.008
v 87.3125 147.125 320.008
v 88 147.125 320.008
v 88.6875 147.125 320.008
v 89.375 147.125 320.008
v 90.0625 147.125 320.008
v 90.75 147.125 320.008
v 91.4375 147.125 320.008
v 92.125 147.125 320.008
v 92.8125 147.125 320.008
v 93.5 147.125 320.008
v 94.1875 147.125 320.008
v 94.875 147.125 320.008
v 95.5625 147.125 320.008
v 96.25 147.125 320.008
v 96.9375 146.44 322
v 96.9375 147.125 320.008
v 97.625 147.125 320.008
v 97.625 146.44 322
v 98.3125 147.125 320.008
v 98.3125 146.44 322
v 98.9973 147.125 322
v 101.062 147.125 320.008
v 101.062 146.44 322
v 100.378 147.125 322
v 101.75 147.125 320.008
v 102.438 147.125 320.008
v 103.125 147.125 320.008
v 103.812 146.44 322
v 103.812 147.125 320.008
v 104.5 147.125 320.008
v 104.5 146.44 322
v 105.188 147.125 320.008
v 105.188 146.44 322
v 105.875 147.125 320.008
v 105.875 146.44 322
v 106.56 147.125 322
v 81.8125 147.81 322
v 82.5 147.81 322
v 82.5027 147.812 322
v 83.1875 147.812 320.008
v 83.875 147.812 320.008
v 84.5625 147.812 320.008
v 85.25 147.812 320.008
v 85.9375 147.812 320.008
v 86.625 147.812 320.008
v 87.3125 147.812 320.008
v 88 147.812 320.008
v 88.6848 147.812 322
v 88.6875 147.81 322
v 89.375 147.81 322
v 90.0625 147.81 322
v 90.75 147.81 322
v 91.4375 147.81 322
v 92.125 147.81 322
v 92.1277 147.812 322
v 92.8125 147.812 320.008
v 93.5 147.812 320.008
v 94.1875 147.812 320.008
v 94.875 147.812 320.008
v 95.5625 147.812 320.008
v 96.25 147.812 320.008
v 96.9375 147.812 320.008
v 97.625 147.812 320.008
v 98.3125 147.812 320.008
v 99 147.128 322
v 99 147.812 320.008
v 99.6875 147.812 320.008
v 99.6875 147.128 322
v 100.375 147.812 320.008
v 100.375 147.128 322
v 101.062 147.812 320.008
v 101.75 147.812 320.008
v 102.438 147.812 320.008
v 103.125 147.812 320.008
v 103.812 147.812 320.008
v 104.5 147.812 320.008
v 105.188 147.812 320.008
v 105.875 147.812 320.008
v 106.562 147.128 322
v 106.562 147.812 320.008
v 107.25 147.812 320.008
v 107.25 147.128 322
v 107.935 147.812 322
v 83.1875 148.497 322
v 83.875 148.497 322
v 84.5625 148.497 322
v 85.25 148.497 322
v 85.9375 148.497 322
v 86.625 148.497 322
v 87.3125 148.497 322
v 88 148.497 322
v 92.8125 148.497 322
v 93.5 148.497 322
v 93.5027 148.5 322
v 94.1875 148.5 320.008
v 94.875 148.5 320.008
v 95.5625 148.5 320.008
v 96.25 148.5 320.008
v 96.9375 148.5 320.008
v 97.625 148.5 320.008
v 98.3125 148.5 320.008
v 99 148.5 320.008
v 99.6875 148.5 320.008
v 100.375 148.5 320.008
v 101.062 148.5 320.008
v 101.75 148.5 320.008
v 102.438 148.5 320.008
v 103.125 148.5 320.008
v 103.812 148.5 320.008
v 104.5 148.5 320.008
v 105.188 148.5 320.008
v 105.875 148.5 320.008
v 106.562 148.5 320.008
v 107.25 148.5 320.008
v 107.938 147.815 322
v 107.938 148.5 320.008
v 108.625 148.5 320.008
v 108.625 147.815 322
v 109.312 148.5 320.008
v 109.312 147.815 322
v 109.997 148.5 322
v 94.1875 149.185 322
v 94.875 149.185 322
v 94.8777 149.188 322
v 95.5625 149.188 320.008
v 96.25 149.188 320.008
v 96.9375 149.188 320.008
v 97.625 149.188 320.008
v 98.3125 149.188 320.008
v 99 149.188 320.008
v 99.6875 149.188 320.008
v 100.375 149.188 320.008
v 101.062 149.188 320.008
v 101.75 149.188 320.008
v 102.438 149.188 320.008
v 103.125 149.188 320.008
v 103.812 149.188 320.008
v 104.5 149.188 320.008
v 105.188 149.188 320.008
v 105.875 149.188 320.008
v 106.562 149.188 320.008
v 107.25 149.188 320.008
v 107.938 149.188 320.008
v 108.625 149.188 320.008
v 109.312 149.188 320.008
v 110 148.503 322
v 110 149.188 320.008
v 110.688 149.188 320.008
v 110.688 148.503 322
v 111.372 149.188 322
v 95.5625 149.872 322
v 96.25 149.872 322
v 96.9375 149.872 322
v 96.9402 149.875 322
v 97.625 149.875 320.008
v 98.3125 149.875 320.008
v 99 149.875 320.008
v 99.6875 149.875 320.008
v 100.375 149.875 320.008
v 101.062 149.875 320.008
v 101.75 149.875 320.008
v 102.438 149.875 320.008
v 103.125 149.875 320.008
v 103.812 149.875 320.008
v 104.5 149.875 320.008
v 105.185 149.875 322
v 105.188 149.872 322
v 105.875 149.872 322
v 105.878 149.875 322
v 106.562 149.875 320.008
v 107.25 149.875 320.008
v 107.938 149.875 320.008
v 108.625 149.875 320.008
v 109.312 149.875 320.008
v 110 149.875 320.008
v 110.688 149.875 320.008
v 111.375 149.19 322
v 111.375 149.875 320.008
v 112.062 149.875 320.008
v 112.062 149.19 322
v 112.75 149.875 320.008
v 112.75 149.19 322
v 113.438 149.875 320.008
v 113.438 149.19 322
v 114.125 149.875 320.008
v 114.125 149.19 322
v 114.812 149.875 320.008
v 114.812 149.19 322
v 115.497 149.875 322
v 97.625 150.56 322
v 98.3125 150.56 322
v 99 150.56 322
v 99.6875 150.56 322
v 100.375 150.56 322
v 101.062 150.56 322
v 101.75 150.56 322
v 102.438 150.56 322
v 103.125 150.56 322
v 103.812 150.56 322
v 104.5 150.56 322
v 106.562 150.56 322
v 107.25 150.56 322
v 107.938 150.56 322
v 108.625 150.56 322
v 108.628 150.562 322
v 109.312 150.562 320.008
v 110 150.562 320.008
v 110.688 150.562 320.008
v 111.375 150.562 320.008
v 112.062 150.562 320.008
v 112.75 150.562 320.008
v 113.438 150.562 320.008
v 114.125 150.562 320.008
v 114.812 150.562 320.008
v 115.497 150.562 322
v 109.312 151.247 322
v 110 151.247 322
v 110.688 151.247 322
v 111.375 151.247 322
v 112.062 151.247 322
v 112.75 151.247 322
v 113.438 151.247 322
v 114.125 151.247 322
v 114.812 151.247 322
v 79.75 138.878 324
v 79.0652 139.562 324
v 80.4375 138.878 324
v 81.125 138.878 324
v 81.8125 138.878 324
v 82.5 138.878 324
v 83.1875 138.878 324
v 83.875 138.878 324
v 84.5598 139.562 324
v 79.0625 139.565 324
v 78.3777 140.25 324
v 84.5625 139.565 324
v 85.25 139.565 324
v 85.9348 140.25 324
v 78.375 140.253 324
v 77.6902 140.938 324
v 85.9375 140.253 324
v 86.625 140.253 324
v 87.3098 140.938 324
v 77.6875 140.94 324
v 77.0027 141.625 324
v 87.3125 140.94 324
v 87.9973 141.625 324
v 77.0027 142.312 324
v 88 141.628 324
v 88.6848 142.312 324
v 77.0027 143 324
v 88.6875 142.315 324
v 89.3723 143 324
v 77.6875 143.685 324
v 77.6902 143.688 324
v 89.375 143.003 324
v 90.0625 143.688 322.008
v 90.0625 143.003 324
v 90.75 143.688 322.008
v 90.75 143.003 324
v 91.4348 143.688 324
v 78.375 144.372 324
v 78.3777 144.375 324
v 91.4375 143.69 324
v 92.125 143.69 324
v 92.8125 143.69 324
v 93.5 143.69 324
v 94.1848 144.375 324
v 78.3777 145.062 324
v 94.1875 144.378 324
v 94.875 145.062 322.008
v 94.875 144.378 324
v 95.5625 145.062 322.008
v 95.5625 144.378 324
v 96.25 145.062 322.008
v 96.25 144.378 324
v 96.9348 145.062 324
v 79.0625 145.747 324
v 79.0652 145.75 324
v 95.5625 145.75 322.008
v 96.25 145.75 322.008
v 96.9375 145.065 324
v 96.9375 145.75 322.008
v 97.6223 145.75 324
v 79.75 146.435 324
v 80.4375 146.435 324
v 80.4402 146.438 324
v 96.9375 146.438 322.008
v 97.625 145.753 324
v 97.625 146.438 322.008
v 98.3098 146.438 324
v 101.75 145.753 324
v 101.065 146.438 324
v 102.438 145.753 324
v 103.125 145.753 324
v 103.81 146.438 324
v 81.125 147.122 324
v 81.1277 147.125 324
v 92.125 147.125 323.992
v 92.1223 147.125 324
v 92.125 147.122 324
v 92.1277 147.125 324
v 98.3125 146.44 324
v 99 147.125 322.008
v 99 146.44 324
v 99.6875 147.125 322.008
v 99.6875 146.44 324
v 100.372 147.125 324
v 101.062 146.44 324
v 100.378 147.125 324
v 103.812 146.44 324
v 104.5 147.125 323.992
v 104.497 147.125 324
v 105.188 147.125 323.992
v 105.875 147.125 323.992
v 81.8125 147.81 324
v 82.5 147.81 324
v 82.5027 147.812 324
v 88.6848 147.812 324
v 88.6875 147.81 324
v 89.375 147.81 324
v 90.0625 147.81 324
v 90.75 147.81 324
v 91.4375 147.81 324
v 92.8125 147.81 324
v 92.8125 147.812 323.992
v 93.5 147.81 324
v 93.5 147.812 323.992
v 94.1875 147.81 324
v 94.1875 147.812 323.992
v 94.1902 147.812 324
v 100.375 147.128 324
v 104.5 147.128 324
v 105.188 147.812 323.992
v 105.185 147.812 324
v 105.875 147.812 323.992
v 106.562 147.812 323.992
v 107.25 147.812 323.992
v 83.1875 148.497 324
v 83.875 148.497 324
v 84.5625 148.497 324
v 85.25 148.497 324
v 85.9375 148.497 324
v 86.625 148.497 324
v 87.3125 148.497 324
v 88 148.497 324
v 94.1875 148.5 323.992
v 94.875 148.497 324
v 94.875 148.5 323.992
v 94.8777 148.5 324
v 105.188 147.815 324
v 105.875 147.815 324
v 106.562 148.5 323.992
v 106.56 148.5 324
v 107.25 148.5 323.992
v 107.938 148.5 323.992
v 108.625 148.5 323.992
v 109.312 148.5 323.992
v 95.5625 149.185 324
v 95.5625 149.188 323.992
v 96.25 149.185 324
v 96.25 149.188 323.992
v 96.2527 149.188 324
v 106.562 148.503 324
v 107.25 148.503 324
v 107.938 149.188 323.992
v 107.935 149.188 324
v 108.625 149.188 323.992
v 109.312 149.188 323.992
v 110 149.188 323.992
v 110.688 149.188 323.992
v 96.9375 149.872 324
v 97.625 149.872 324
v 97.625 149.875 323.992
v 98.3125 149.872 324
v 98.3125 149.875 323.992
v 98.3152 149.875 324
v 105.185 149.875 324
v 105.188 149.872 324
v 105.875 149.872 324
v 105.878 149.875 324
v 107.938 149.19 324
v 108.625 149.19 324
v 109.312 149.875 323.992
v 109.31 149.875 324
v 110 149.875 323.992
v 110.688 149.875 323.992
v 111.375 149.875 323.992
v 112.062 149.875 323.992
v 112.75 149.875 323.992
v 113.438 149.875 323.992
v 114.125 149.875 323.992
v 114.812 149.875 323.992
v 99 150.56 324
v 99.6875 150.56 324
v 100.375 150.56 324
v 101.062 150.56 324
v 101.75 150.56 324
v 102.438 150.56 324
v 103.125 150.56 324
v 103.812 150.56 324
v 104.5 150.56 324
v 106.562 150.56 324
v 107.25 150.56 324
v 107.938 150.56 324
v 108.625 150.56 324
v 109.312 149.878 324
v 108.628 150.562 324
v 110 149.878 324
v 110.688 149.878 324
v 111.375 149.878 324
v 112.062 149.878 324
v 112.75 150.562 323.992
v 112.747 150.562 324
v 113.438 150.562 323.992
v 114.125 150.562 323.992
v 114.812 150.562 323.992
v 109.312 151.247 324
v 110 151.247 324
v 110.688 151.247 324
v 111.375 151.247 324
v 112.062 151.247 324
v 74.25 134.75 324.008
v 74.25 134.065 326
v 73.5652 134.75 326
v 74.9375 134.75 324.008
v 74.9375 134.065 326
v 75.625 134.75 324.008
v 75.625 134.065 326
v 76.3125 134.75 324.008
v 76.3125 134.065 326
v 76.9973 134.75 326
v 74.25 135.438 324.008
v 73.5652 135.438 326
v 74.9375 135.438 324.008
v 75.625 135.438 324.008
v 76.3125 135.438 324.008
v 77 134.753 326
v 77 135.438 324.008
v 77.6875 135.438 324.008
v 77.6875 134.753 326
v 78.3723 135.438 326
v 74.25 136.125 324.008
v 73.5652 136.125 326
v 74.9375 136.125 324.008
v 75.625 136.125 324.008
v 76.3125 136.125 324.008
v 77 136.125 324.008
v 77.6875 136.125 324.008
v 78.375 135.44 326
v 78.375 136.125 324.008
v 79.0625 136.125 324.008
v 79.0625 135.44 326
v 79.75 136.125 324.008
v 79.75 135.44 326
v 80.4348 136.125 326
v 74.25 136.812 324.008
v 73.5652 136.812 326
v 74.9375 136.812 324.008
v 75.625 136.812 324.008
v 76.3125 136.812 324.008
v 77 136.812 324.008
v 77.6875 136.812 324.008
v 78.375 136.812 324.008
v 79.0625 136.812 324.008
v 79.75 136.812 324.008
v 80.4375 136.128 326
v 80.4375 136.812 324.008
v 81.125 136.812 324.008
v 81.125 136.128 326
v 81.8125 136.812 324.008
v 81.8125 136.128 326
v 82.4973 136.812 326
v 74.25 137.5 324.008
v 73.5652 137.5 326
v 74.9375 137.5 324.008
v 75.625 137.5 324.008
v 76.3125 137.5 324.008
v 77 137.5 324.008
v 77.6875 137.5 324.008
v 78.375 137.5 324.008
v 79.0625 137.5 324.008
v 79.75 137.5 324.008
v 80.4375 137.5 324.008
v 81.125 137.5 324.008
v 81.8125 137.5 324.008
v 82.5 136.815 326
v 82.5 137.5 324.008
v 83.1848 137.5 326
v 74.25 138.188 324.008
v 73.5652 138.188 326
v 74.9375 138.188 324.008
v 75.625 138.188 324.008
v 76.3125 138.188 324.008
v 77 138.188 324.008
v 77.6875 138.188 324.008
v 78.375 138.188 324.008
v 79.0625 138.188 324.008
v 79.75 138.188 324.008
v 80.4375 138.188 324.008
v 81.125 138.188 324.008
v 81.8125 138.188 324.008
v 82.5 138.188 324.008
v 83.1875 137.503 326
v 83.1875 138.188 324.008
v 83.8723 138.188 326
v 74.25 138.872 326
v 74.2527 138.875 326
v 74.9375 138.875 324.008
v 75.625 138.875 324.008
v 76.3125 138.875 324.008
v 77 138.875 324.008
v 77.6875 138.875 324.008
v 78.375 138.875 324.008
v 79.0625 138.875 324.008
v 79.75 138.875 324.008
v 80.4375 138.875 324.008
v 81.125 138.875 324.008
v 81.8125 138.875 324.008
v 82.5 138.875 324.008
v 83.1875 138.875 324.008
v 83.875 138.19 326
v 83.875 138.875 324.008
v 84.5598 138.875 326
v 74.9375 139.562 324.008
v 74.2527 139.562 326
v 75.625 139.562 324.008
v 76.3125 139.562 324.008
v 77 139.562 324.008
v 77.6875 139.562 324.008
v 78.375 139.562 324.008
v 79.0625 139.562 324.008
v 84.5598 139.562 326
v 74.9375 140.247 326
v 74.9402 140.25 326
v 75.625 140.25 324.008
v 76.3125 140.25 324.008
v 77 140.25 324.008
v 77.6875 140.25 324.008
v 78.375 140.25 324.008
v 84.5625 139.565 326
v 85.25 139.565 326
v 85.9348 140.25 326
v 75.625 140.938 324.008
v 74.9402 140.938 326
v 76.3125 140.938 324.008
v 77 140.938 324.008
v 77.6875 140.938 324.008
v 85.9375 140.253 326
v 86.625 140.938 325.992
v 86.6223 140.938 326
v 75.625 141.622 326
v 75.6277 141.625 326
v 76.3125 141.625 324.008
v 77 141.625 324.008
v 86.625 141.625 325.992
v 86.6223 141.625 326
v 87.3125 141.625 325.992
v 76.3125 142.312 324.008
v 75.6277 142.312 326
v 77 142.312 324.008
v 86.625 141.628 326
v 87.3125 142.312 325.992
v 87.3098 142.312 326
v 88 142.312 325.992
v 76.3125 142.997 326
v 76.3152 143 326
v 77 143 324.008
v 87.3125 142.315 326
v 88 143 325.992
v 87.9973 143 326
v 88.6875 143 325.992
v 77 143.685 326
v 77.6875 143.688 324.008
v 77.0027 143.688 326
v 88 143.688 325.992
v 87.9973 143.688 326
v 88.6875 143.688 325.992
v 89.375 143.688 325.992
v 90.0625 143.688 325.992
v 90.75 143.688 325.992
v 77.6875 144.372 326
v 78.375 144.375 324.008
v 77.6902 144.375 326
v 88 144.375 325.992
v 87.9973 144.375 326
v 88.6875 144.375 325.992
v 89.375 144.375 325.992
v 90.0625 144.375 325.992
v 90.75 144.375 325.992
v 91.4375 144.375 325.992
v 92.125 144.375 325.992
v 92.8125 144.375 325.992
v 93.5 144.375 325.992
v 78.375 145.06 326
v 79.0625 145.06 326
v 79.0625 145.062 325.992
v 79.0652 145.062 326
v 88 145.062 325.992
v 87.9973 145.062 326
v 88.6875 145.062 325.992
v 89.375 145.062 325.992
v 90.0625 145.062 325.992
v 90.75 145.062 325.992
v 91.4375 145.062 325.992
v 92.125 145.062 325.992
v 92.8125 145.062 325.992
v 93.5 145.062 325.992
v 94.1875 145.062 325.992
v 94.875 145.062 325.992
v 95.5625 145.062 325.992
v 96.25 145.062 325.992
v 79.75 145.747 326
v 79.75 145.75 325.992
v 79.7527 145.75 326
v 87.3125 145.75 325.992
v 87.3098 145.75 326
v 87.3125 145.747 326
v 88 145.75 325.992
v 88.6875 145.75 325.992
v 89.375 145.75 325.992
v 90.0625 145.75 325.992
v 90.75 145.75 325.992
v 91.4375 145.75 325.992
v 92.125 145.75 325.992
v 92.8125 145.75 325.992
v 93.5 145.75 325.992
v 94.1875 145.75 325.992
v 94.875 145.75 325.992
v 95.5625 145.75 325.992
v 96.25 145.75 325.992
v 96.9375 145.75 325.992
v 80.4375 146.435 326
v 81.125 146.435 326
v 81.125 146.438 325.992
v 81.1277 146.438 326
v 86.625 146.438 325.992
v 86.6223 146.438 326
v 86.625 146.435 326
v 87.3125 146.438 325.992
v 88 146.438 325.992
v 88.6875 146.438 325.992
v 89.375 146.438 325.992
v 90.0625 146.438 325.992
v 90.75 146.438 325.992
v 91.4375 146.438 325.992
v 92.125 146.438 325.992
v 92.8125 146.438 325.992
v 93.5 146.438 325.992
v 94.1875 146.438 325.992
v 94.875 146.438 325.992
v 95.5625 146.438 325.992
v 96.25 146.438 325.992
v 96.9375 146.438 325.992
v 97.625 146.438 325.992
v 101.75 146.438 325.992
v 102.438 146.438 325.992
v 103.125 146.438 325.992
v 81.8125 147.122 326
v 81.8125 147.125 325.992
v 82.5 147.122 326
v 82.5 147.125 325.992
v 82.5027 147.125 326
v 85.9375 147.125 325.992
v 85.9348 147.125 326
v 85.9375 147.122 326
v 86.625 147.125 325.992
v 87.3125 147.125 325.992
v 88 147.125 325.992
v 88.6875 147.125 325.992
v 89.375 147.125 325.992
v 90.0625 147.125 325.992
v 90.75 147.125 325.992
v 91.4375 147.125 325.992
v 92.8125 147.125 325.992
v 93.5 147.125 325.992
v 94.1875 147.125 325.992
v 94.875 147.125 325.992
v 95.5625 147.125 325.992
v 96.25 147.125 325.992
v 96.9375 147.125 325.992
v 97.625 147.125 325.992
v 98.3125 147.125 325.992
v 99 147.125 325.992
v 99.6875 147.125 325.992
v 101.062 147.125 325.992
v 101.75 147.125 325.992
v 102.438 147.125 325.992
v 103.125 147.125 325.992
v 103.812 147.125 325.992
v 83.1875 147.81 326
v 83.1875 147.812 325.992
v 83.1902 147.812 326
v 85.25 147.812 325.992
v 85.2473 147.812 326
v 85.25 147.81 326
v 85.9375 147.812 325.992
v 86.625 147.812 325.992
v 87.3125 147.812 325.992
v 88 147.812 325.992
v 94.875 147.812 325.992
v 95.5625 147.812 325.992
v 96.25 147.812 325.992
v 96.9375 147.812 325.992
v 97.625 147.812 325.992
v 98.3125 147.812 325.992
v 99 147.812 325.992
v 99.6875 147.812 325.992
v 100.375 147.812 325.992
v 101.062 147.812 325.992
v 101.75 147.812 325.992
v 102.438 147.812 325.992
v 103.125 147.812 325.992
v 103.812 147.812 325.992
v 104.5 147.812 325.992
v 83.875 148.497 326
v 84.5625 148.497 326
v 95.5625 148.5 325.992
v 96.25 148.5 325.992
v 96.9375 148.5 325.992
v 97.625 148.5 325.992
v 98.3125 148.5 325.992
v 99 148.5 325.992
v 99.6875 148.5 325.992
v 100.375 148.5 325.992
v 101.062 148.5 325.992
v 101.75 148.5 325.992
v 102.438 148.5 325.992
v 103.125 148.5 325.992
v 103.812 148.5 325.992
v 104.5 148.5 325.992
v 105.188 148.5 325.992
v 105.875 148.5 325.992
v 96.9375 149.188 325.992
v 97.625 149.188 325.992
v 98.3125 149.188 325.992
v 99 149.188 325.992
v 99.6875 149.188 325.992
v 100.375 149.188 325.992
v 101.062 149.188 325.992
v 101.75 149.188 325.992
v 102.438 149.188 325.992
v 103.125 149.188 325.992
v 103.812 149.188 325.992
v 104.5 149.188 325.992
v 105.188 149.188 325.992
v 105.875 149.188 325.992
v 106.562 149.188 325.992
v 107.25 149.188 325.992
v 99 149.875 325.992
v 99.6875 149.875 325.992
v 100.375 149.875 325.992
v 101.062 149.875 325.992
v 101.75 149.875 325.992
v 102.438 149.875 325.992
v 103.125 149.875 325.992
v 103.812 149.875 325.992
v 104.5 149.875 325.992
v 106.562 149.875 325.992
v 107.25 149.875 325.992
v 107.938 149.875 325.992
v 108.625 149.875 325.992
v 109.312 150.562 325.992
v 110 150.562 325.992
v 110.688 150.562 325.992
v 111.375 150.562 325.992
v 112.062 150.562 325.992
v 68.75 132.688 326.008
v 68.75 132.003 328
v 68.0652 132.688 328
v 69.4375 132.688 326.008
v 69.4375 132.003 328
v 70.1223 132.688 328
v 68.0625 133.375 326.008
v 68.0625 132.69 328
v 67.3777 133.375 328
v 68.75 133.375 326.008
v 69.4375 133.375 326.008
v 70.125 132.69 328
v 70.125 133.375 326.008
v 70.8125 133.375 326.008
v 70.8125 132.69 328
v 71.4973 133.375 328
v 68.0625 134.062 326.008
v 67.3777 134.062 328
v 68.75 134.062 326.008
v 69.4375 134.062 326.008
v 70.125 134.062 326.008
v 70.8125 134.062 326.008
v 71.5 133.378 328
v 71.5 134.062 326.008
v 72.1875 134.062 326.008
v 72.1875 133.378 328
v 72.875 134.062 326.008
v 72.875 133.378 328
v 73.5598 134.062 328
v 68.0625 134.747 328
v 68.0652 134.75 328
v 68.75 134.75 326.008
v 69.4375 134.75 326.008
v 70.125 134.75 326.008
v 70.8125 134.75 326.008
v 71.5 134.75 326.008
v 72.1875 134.75 326.008
v 72.875 134.75 326.008
v 73.5625 134.065 328
v 73.5625 134.75 326.008
v 74.25 134.065 328
v 74.9375 134.065 328
v 75.625 134.065 328
v 76.3125 134.065 328
v 76.9973 134.75 328
v 68.75 135.435 328
v 68.7527 135.438 328
v 69.4375 135.438 326.008
v 70.125 135.438 326.008
v 70.8125 135.438 326.008
v 71.5 135.438 326.008
v 72.1875 135.438 326.008
v 72.875 135.438 326.008
v 73.5625 135.438 326.008
v 77 134.753 328
v 77.6875 134.753 328
v 78.3723 135.438 328
v 69.4375 136.122 328
v 69.4402 136.125 328
v 70.125 136.125 326.008
v 70.8125 136.125 326.008
v 71.5 136.125 326.008
v 72.1875 136.125 326.008
v 72.875 136.125 326.008
v 73.5625 136.125 326.008
v 78.375 135.44 328
v 79.0625 135.44 328
v 79.75 135.44 328
v 80.4348 136.125 328
v 70.125 136.81 328
v 70.8125 136.81 328
v 70.8152 136.812 328
v 71.5 136.812 326.008
v 72.1875 136.812 326.008
v 72.875 136.812 326.008
v 73.5625 136.812 326.008
v 80.4375 136.128 328
v 81.125 136.128 328
v 81.8125 136.128 328
v 82.4973 136.812 328
v 71.5 137.497 328
v 71.5027 137.5 328
v 72.1875 137.5 326.008
v 72.875 137.5 326.008
v 73.5625 137.5 326.008
v 82.5 136.815 328
v 83.1848 137.5 328
v 72.1875 138.185 328
v 72.1902 138.188 328
v 72.875 138.188 326.008
v 73.5625 138.188 326.008
v 83.1875 137.503 328
v 83.8723 138.188 328
v 72.875 138.872 328
v 73.5625 138.872 328
v 74.25 138.875 326.008
v 73.5652 138.875 328
v 83.875 138.19 328
v 84.5598 138.875 328
v 74.25 139.56 328
v 74.2527 139.562 328
v 84.5598 139.562 328
v 74.9375 140.247 328
v 74.9402 140.25 328
v 84.5625 139.565 328
v 85.25 140.25 327.992
v 85.2473 140.25 328
v 74.9402 140.938 328
v 85.25 140.938 327.992
v 85.2473 140.938 328
v 85.9375 140.938 327.992
v 75.625 141.622 328
v 75.6277 141.625 328
v 85.25 141.625 327.992
v 85.2473 141.625 328
v 85.9375 141.625 327.992
v 75.6277 142.312 328
v 85.25 142.312 327.992
v 85.2473 142.312 328
v 85.9375 142.312 327.992
v 86.625 142.312 327.992
v 76.3125 142.997 328
v 76.3152 143 328
v 85.25 143 327.992
v 85.2473 143 328
v 85.9375 143 327.992
v 86.625 143 327.992
v 87.3125 143 327.992
v 77 143.685 328
v 77.0027 143.688 328
v 85.25 143.688 327.992
v 85.2473 143.688 328
v 85.9375 143.688 327.992
v 86.625 143.688 327.992
v 87.3125 143.688 327.992
v 77.6875 144.372 328
v 77.6902 144.375 328
v 85.25 144.375 327.992
v 85.2473 144.375 328
v 85.9375 144.375 327.992
v 86.625 144.375 327.992
v 87.3125 144.375 327.992
v 78.375 145.06 328
v 79.0625 145.06 328
v 79.0652 145.062 328
v 85.25 145.062 327.992
v 85.2473 145.062 328
v 85.9375 145.062 327.992
v 86.625 145.062 327.992
v 87.3125 145.062 327.992
v 79.75 145.747 328
v 79.7527 145.75 328
v 84.5625 145.75 327.992
v 84.5598 145.75 328
v 84.5625 145.747 328
v 85.25 145.75 327.992
v 85.9375 145.75 327.992
v 86.625 145.75 327.992
v 80.4375 146.435 328
v 81.125 146.435 328
v 81.1277 146.438 328
v 83.875 146.438 327.992
v 83.8723 146.438 328
v 83.875 146.435 328
v 84.5625 146.438 327.992
v 85.25 146.438 327.992
v 85.9375 146.438 327.992
v 81.8125 147.122 328
v 82.5 147.122 328
v 83.1875 147.122 328
v 83.1875 147.125 327.992
v 83.875 147.125 327.992
v 84.5625 147.125 327.992
v 85.25 147.125 327.992
v 83.875 147.812 327.992
v 84.5625 147.812 327.992
v 68.75 132.688 329.992
v 69.4375 132.688 329.992
v 68.0625 133.375 329.992
v 68.75 133.375 329.992
v 69.4375 133.375 329.992
v 70.125 133.375 329.992
v 70.8125 133.375 329.992
v 68.0625 134.062 329.992
v 68.75 134.062 329.992
v 69.4375 134.062 329.992
v 70.125 134.062 329.992
v 70.8125 134.062 329.992
v 71.5 134.062 329.992
v 72.1875 134.062 329.992
v 72.875 134.062 329.992
v 68.75 134.75 329.992
v 69.4375 134.75 329.992
v 70.125 134.75 329.992
v 70.8125 134.75 329.992
v 71.5 134.75 329.992
v 72.1875 134.75 329.992
v 72.875 134.75 329.992
v 73.5625 134.75 329.992
v 73.5652 134.75 330
v 74.25 134.065 330
v 74.9375 134.065 330
v 75.625 134.065 330
v 76.3125 134.065 330
v 76.9973 134.75 330
v 69.4375 135.438 329.992
v 70.125 135.438 329.992
v 70.8125 135.438 329.992
v 71.5 135.438 329.992
v 72.1875 135.438 329.992
v 72.875 135.438 329.992
v 73.5625 135.438 329.992
v 73.5652 135.438 330
v 77 134.753 330
v 77.6875 134.753 330
v 78.3723 135.438 330
v 70.125 136.125 329.992
v 70.8125 136.125 329.992
v 71.5 136.125 329.992
v 72.1875 136.125 329.992
v 72.875 136.125 329.992
v 73.5625 136.125 329.992
v 73.5652 136.125 330
v 78.375 135.44 330
v 79.0625 135.44 330
v 79.75 136.125 329.992
v 79.7473 136.125 330
v 71.5 136.812 329.992
v 72.1875 136.812 329.992
v 72.875 136.812 329.992
v 73.5625 136.812 329.992
v 73.5652 136.812 330
v 79.75 136.128 330
v 80.4375 136.812 329.992
v 80.4348 136.812 330
v 81.125 136.812 329.992
v 81.8125 136.812 329.992
v 72.1875 137.5 329.992
v 72.875 137.5 329.992
v 73.5625 137.5 329.992
v 73.5652 137.5 330
v 80.4375 136.815 330
v 81.125 137.5 329.992
v 81.1223 137.5 330
v 81.8125 137.5 329.992
v 82.5 137.5 329.992
v 72.875 138.188 329.992
v 73.5625 138.188 329.992
v 73.5652 138.188 330
v 81.125 138.188 329.992
v 81.1223 138.188 330
v 81.8125 138.188 329.992
v 82.5 138.188 329.992
v 83.1875 138.188 329.992
v 74.25 138.872 330
v 74.25 138.875 329.992
v 74.2527 138.875 330
v 81.125 138.19 330
v 81.8125 138.875 329.992
v 81.8098 138.875 330
v 82.5 138.875 329.992
v 83.1875 138.875 329.992
v 83.875 138.875 329.992
v 74.2527 139.562 330
v 81.8125 139.562 329.992
v 81.8098 139.562 330
v 82.5 139.562 329.992
v 83.1875 139.562 329.992
v 83.875 139.562 329.992
v 74.9375 140.247 330
v 74.9402 140.25 330
v 81.8125 139.565 330
v 82.5 140.25 329.992
v 82.4973 140.25 330
v 83.1875 140.25 329.992
v 83.875 140.25 329.992
v 84.5625 140.25 329.992
v 74.9402 140.938 330
v 82.5 140.938 329.992
v 82.4973 140.938 330
v 83.1875 140.938 329.992
v 83.875 140.938 329.992
v 84.5625 140.938 329.992
v 75.625 141.622 330
v 75.6277 141.625 330
v 82.5 141.625 329.992
v 82.4973 141.625 330
v 83.1875 141.625 329.992
v 83.875 141.625 329.992
v 84.5625 141.625 329.992
v 75.6277 142.312 330
v 82.5 141.628 330
v 83.1875 142.312 329.992
v 83.1848 142.312 330
v 83.875 142.312 329.992
v 84.5625 142.312 329.992
v 76.3125 142.997 330
v 76.3152 143 330
v 83.1875 143 329.992
v 83.1848 143 330
v 83.875 143 329.992
v 84.5625 143 329.992
v 77 143.685 330
v 77.0027 143.688 330
v 83.1875 143.003 330
v 83.875 143.688 329.992
v 83.8723 143.688 330
v 84.5625 143.688 329.992
v 77.6875 144.372 330
v 77.6902 144.375 330
v 83.875 144.375 329.992
v 83.8723 144.375 330
v 84.5625 144.375 329.992
v 78.375 145.06 330
v 79.0625 145.06 330
v 79.0652 145.062 330
v 83.875 145.062 329.992
v 83.8723 145.062 330
v 84.5625 145.062 329.992
v 79.75 145.747 330
v 79.7527 145.75 330
v 83.875 145.75 329.992
v 83.8723 145.75 330
v 80.4375 146.435 330
v 81.125 146.435 330
v 81.1277 146.438 330
v 83.8723 146.438 330
v 81.8125 147.122 330
v 82.5 147.122 330
v 83.1875 147.122 330
v 74.25 134.75 331.992
v 74.9375 134.75 331.992
v 75.625 134.75 331.992
v 76.3125 134.75 331.992
v 74.25 135.438 331.992
v 74.9375 135.438 331.992
v 75.625 135.438 331.992
v 76.3125 135.438 331.992
v 77 135.438 331.992
v 77.6875 135.438 331.992
v 74.25 136.125 331.992
v 74.9375 136.125 331.992
v 75.625 136.125 331.992
v 76.3125 136.125 331.992
v 77 136.125 331.992
v 77.6875 136.125 331.992
v 78.375 136.125 331.992
v 79.0625 136.125 331.992
v 74.25 136.812 331.992
v 74.9375 136.812 331.992
v 75.625 136.812 331.992
v 76.3125 136.812 331.992
v 77 136.812 331.992
v 77.6875 136.812 331.992
v 78.375 136.812 331.992
v 79.0625 136.812 331.992
v 79.75 136.812 331.992
v 74.25 137.5 331.992
v 74.9375 137.5 331.992
v 75.625 137.5 331.992
v 76.3125 137.5 331.992
v 77 137.5 331.992
v 77.6875 137.5 331.992
v 78.375 137.5 331.992
v 79.0625 137.5 331.992
v 79.75 137.5 331.992
v 80.4375 137.5 331.992
v 74.25 138.188 331.992
v 74.9375 138.188 331.992
v 75.625 138.188 331.992
v 76.3125 138.188 331.992
v 77 138.188 331.992
v 77.6875 138.188 331.992
v 78.375 138.188 331.992
v 79.0625 138.188 331.992
v 79.75 138.188 331.992
v 80.4375 138.188 331.992
v 74.9375 138.875 331.992
v 75.625 138.875 331.992
v 76.3125 138.875 331.992
v 77 138.875 331.992
v 77.6875 138.875 331.992
v 78.375 138.875 331.992
v 79.0625 138.875 331.992
v 79.75 138.875 331.992
v 80.4375 138.875 331.992
v 81.125 138.875 331.992
v 74.9375 139.562 331.992
v 75.625 139.562 331.992
v 76.3125 139.562 331.992
v 77 139.562 331.992
v 77.6875 139.562 331.992
v 78.375 139.562 331.992
v 79.0625 139.562 331.992
v 79.75 139.562 331.992
v 80.4375 139.562 331.992
v 81.125 139.562 331.992
v 75.625 140.25 331.992
v 76.3125 140.25 331.992
v 77 140.25 331.992
v 77.6875 140.25 331.992
v 78.375 140.25 331.992
v 79.0625 140.25 331.992
v 79.75 140.25 331.992
v 80.4375 140.25 331.992
v 81.125 140.25 331.992
v 81.8125 140.25 331.992
v 75.625 140.938 331.992
v 76.3125 140.938 331.992
v 77 140.938 331.992
v 77.6875 140.938 331.992
v 78.375 140.938 331.992
v 79.0625 140.938 331.992
v 79.75 140.938 331.992
v 80.4375 140.938 331.992
v 81.125 140.938 331.992
v 81.8125 140.938 331.992
v 76.3125 141.625 331.992
v 77 141.625 331.992
v 77.6875 141.625 331.992
v 78.375 141.625 331.992
v 79.0625 141.625 331.992
v 79.75 141.625 331.992
v 80.4375 141.625 331.992
v 81.125 141.625 331.992
v 81.8125 141.625 331.992
v 76.3125 142.312 331.992
v 77 142.312 331.992
v 77.6875 142.312 331.992
v 78.375 142.312 331.992
v 79.0625 142.312 331.992
v 79.75 142.312 331.992
v 80.4375 142.312 331.992
v 81.125 142.312 331.992
v 81.8125 142.312 331.992
v 82.5 142.312 331.992
v 77 143 331.992
v 77.6875 143 331.992
v 78.375 143 331.992
v 79.0625 143 331.992
v 79.75 143 331.992
v 80.4375 143 331.992
v 81.125 143 331.992
v 81.8125 143 331.992
v 82.5 143 331.992
v 77.6875 143.688 331.992
v 78.375 143.688 331.992
v 79.0625 143.688 331.992
v 79.75 143.688 331.992
v 80.4375 143.688 331.992
v 81.125 143.688 331.992
v 81.8125 143.688 331.992
v 82.5 143.688 331.992
v 83.1875 143.688 331.992
v 78.375 144.375 331.992
v 79.0625 144.375 331.992
v 79.75 144.375 331.992
v 80.4375 144.375 331.992
v 81.125 144.375 331.992
v 81.8125 144.375 331.992
v 82.5 144.375 331.992
v 83.1875 144.375 331.992
v 79.75 145.062 331.992
v 80.4375 145.062 331.992
v 81.125 145.062 331.992
v 81.8125 145.062 331.992
v 82.5 145.062 331.992
v 83.1875 145.062 331.992
v 80.4375 145.75 331.992
v 81.125 145.75 331.992
v 81.8125 145.75 331.992
v 82.5 145.75 331.992
v 83.1875 145.75 331.992
v 81.8125 146.438 331.992
v 82.5 146.438 331.992
v 83.1875 146.438 331.992

f 1 2 3
f 1 4 5
f 2 1 5
f 4 6 7
f 5 4 7
f 6 8 9
f 7 6 9
f 9 8 10
f 11 12 13
f 3 12 11
f 3 11 1
f 1 11 14
f 4 1 15
f 15 1 14
f 6 4 16
f 16 4 15
f 8 6 17
f 17 6 16
f 18 10 8
f 18 8 19
f 19 8 17
f 19 20 21
f 18 19 21
f 21 20 22
f 23 11 13
f 24 23 13
f 14 11 25
f 25 11 23
f 15 14 26
f 26 14 25
f 16 15 27
f 27 15 26
f 17 16 28
f 28 16 27
f 19 17 29
f 29 17 28
f 20 19 30
f 30 19 29
f 31 22 20
f 31 20 32
f 32 20 30
f 32 33 34
f 31 32 34
f 34 33 35
f 36 23 24
f 37 36 24
f 25 23 38
f 38 23 36
f 26 25 39
f 39 25 38
f 27 26 40
f 40 26 39
f 28 27 41
f 41 27 40
f 29 28 42
f 42 28 41
f 30 29 43
f 43 29 42
f 32 30 44
f 44 30 43
f 33 32 45
f 45 32 44
f 46 35 33
f 46 33 47
f 47 33 45
f 46 47 48
f 49 36 37
f 50 49 37
f 38 36 51
f 51 36 49
f 39 38 52
f 52 38 51
f 40 39 53
f 53 39 52
f 41 40 54
f 54 40 53
f 42 41 55
f 55 41 54
f 43 42 56
f 56 42 55
f 44 43 57
f 57 43 56
f 45 44 58
f 58 44 57
f 47 45 59
f 59 45 58
f 60 48 47
f 60 47 61
f 61 47 59
f 60 61 62
f 63 49 50
f 64 63 50
f 51 49 65
f 65 49 63
f 52 51 66
f 66 51 65
f 53 52 67
f 67 52 66
f 54 53 68
f 68 53 67
f 55 54 69
f 69 54 68
f 56 55 70
f 70 55 69
f 57 56 71
f 71 56 70
f 58 57 72
f 72 57 71
f 59 58 73
f 73 58 72
f 61 59 74
f 74 59 73
f 75 62 61
f 75 61 76
f 76 61 74
f 75 76 77
f 63 64 78
f 78 79 80
f 78 80 63
f 63 80 65
f 66 65 81
f 81 65 80
f 67 66 82
f 82 66 81
f 68 67 83
f 83 67 82
f 69 68 84
f 84 68 83
f 70 69 85
f 85 69 84
f 71 70 86
f 86 70 85
f 72 71 87
f 87 71 86
f 73 72 88
f 88 72 87
f 74 73 89
f 89 73 88
f 76 74 90
f 90 74 89
f 91 77 76
f 90 91 76
f 80 79 92
f 81 80 92
f 93 81 92
f 82 81 93
f 94 82 93
f 83 82 94
f 95 83 94
f 95 96 97
f 95 97 83
f 83 97 84
f 85 84 98
f 98 84 97
f 86 85 99
f 99 85 98
f 87 86 100
f 100 86 99
f 88 87 101
f 101 87 100
f 89 88 102
f 102 88 101
f 103 104 90
f 103 90 102
f 102 90 89
f 91 90 104
f 97 96 105
f 98 97 105
f 106 98 105
f 99 98 106
f 107 99 106
f 100 99 107
f 108 100 107
f 101 100 108
f 109 101 108
f 102 101 109
f 110 102 109
f 103 102 110
f 111 112 113
f 111 114 115
f 112 111 115
f 114 116 117
f 115 114 117
f 116 118 119
f 117 116 119
f 118 120 121
f 119 118 121
f 120 122 123
f 121 120 123
f 122 124 125
f 123 122 125
f 125 124 126
f 127 128 129
f 113 128 127
f 113 127 111
f 111 127 130
f 114 111 131
f 131 111 130
f 116 114 132
f 132 114 131
f 118 116 133
f 133 116 132
f 120 118 134
f 134 118 133
f 122 120 135
f 135 120 134
f 124 122 136
f 136 122 135
f 137 126 124
f 137 124 138
f 138 124 136
f 138 139 140
f 137 138 140
f 140 139 141
f 142 143 144
f 129 143 142
f 129 142 127
f 127 142 145
f 130 127 146
f 146 127 145
f 131 130 147
f 147 130 146
f 132 131 148
f 148 131 147
f 133 132 149
f 149 132 148
f 134 133 150
f 150 133 149
f 135 134 151
f 151 134 150
f 136 135 152
f 152 135 151
f 138 136 153
f 153 136 152
f 139 138 154
f 154 138 153
f 155 141 139
f 155 139 156
f 156 139 154
f 156 157 158
f 155 156 158
f 158 157 159
f 160 161 162
f 144 161 160
f 144 160 142
f 142 160 163
f 145 142 164
f 164 142 163
f 146 145 165
f 165 145 164
f 147 146 166
f 166 146 165
f 148 147 167
f 167 147 166
f 2 167 3
f 2 149 167
f 149 148 167
f 5 149 2
f 150 149 5
f 7 150 5
f 151 150 7
f 9 151 7
f 152 151 9
f 10 152 9
f 10 168 152
f 168 153 152
f 154 153 169
f 169 153 168
f 156 154 170
f 170 154 169
f 157 156 171
f 171 156 170
f 172 159 157
f 172 157 173
f 173 157 171
f 172 173 174
f 175 160 162
f 176 175 162
f 163 160 177
f 177 160 175
f 164 163 178
f 178 163 177
f 165 164 179
f 179 164 178
f 166 165 180
f 180 165 179
f 12 180 13
f 12 167 180
f 167 166 180
f 3 167 12
f 10 18 168
f 21 168 18
f 169 168 21
f 22 169 21
f 22 181 169
f 181 170 169
f 171 170 182
f 182 170 181
f 173 171 183
f 183 171 182
f 184 174 173
f 184 173 185
f 185 173 183
f 184 185 186
f 187 175 176
f 188 187 176
f 177 175 189
f 189 175 187
f 178 177 190
f 190 177 189
f 179 178 191
f 191 178 190
f 180 179 192
f 192 179 191
f 13 192 24
f 180 192 13
f 22 31 181
f 34 181 31
f 182 181 34
f 35 182 34
f 35 193 182
f 193 183 182
f 185 183 194
f 194 183 193
f 195 186 185
f 195 185 196
f 196 185 194
f 195 196 197
f 187 188 198
f 198 199 200
f 198 200 187
f 187 200 189
f 190 189 201
f 201 189 200
f 191 190 202
f 202 190 201
f 192 191 203
f 203 191 202
f 24 203 37
f 192 203 24
f 35 46 193
f 48 193 46
f 48 204 193
f 204 194 193
f 196 194 205
f 205 194 204
f 206 197 196
f 206 196 207
f 207 196 205
f 206 207 208
f 200 199 209
f 209 210 211
f 209 211 200
f 200 211 201
f 202 201 212
f 212 201 211
f 203 202 213
f 213 202 212
f 37 213 50
f 203 213 37
f 48 60 204
f 62 204 60
f 62 214 204
f 214 205 204
f 207 205 215
f 215 205 214
f 216 208 207
f 216 207 217
f 217 207 215
f 217 218 219
f 216 217 219
f 218 220 221
f 219 218 221
f 220 222 223
f 221 220 223
f 222 224 225
f 223 222 225
f 224 226 227
f 225 224 227
f 227 226 228
f 229 211 210
f 230 229 210
f 212 211 231
f 231 211 229
f 213 212 232
f 232 212 231
f 50 232 64
f 213 232 50
f 62 75 214
f 77 214 75
f 77 233 214
f 233 215 214
f 217 215 234
f 234 215 233
f 218 217 235
f 235 217 234
f 220 218 236
f 236 218 235
f 222 220 237
f 237 220 236
f 224 222 238
f 238 222 237
f 226 224 239
f 239 224 238
f 240 228 226
f 240 226 241
f 241 226 239
f 240 241 242
f 229 230 243
f 243 244 245
f 243 245 229
f 229 245 231
f 232 231 246
f 246 231 245
f 64 247 78
f 64 232 247
f 232 246 247
f 78 247 79
f 233 91 248
f 77 91 233
f 234 233 249
f 249 233 248
f 235 234 250
f 250 234 249
f 236 235 251
f 251 235 250
f 237 236 252
f 252 236 251
f 238 237 253
f 253 237 252
f 239 238 254
f 254 238 253
f 241 239 255
f 255 239 254
f 256 242 241
f 256 241 257
f 257 241 255
f 256 257 258
f 245 244 259
f 246 245 259
f 260 246 259
f 260 261 262
f 260 262 246
f 246 262 247
f 79 263 92
f 79 247 263
f 247 262 263
f 92 264 93
f 263 264 92
f 93 265 94
f 264 265 93
f 94 266 95
f 265 266 94
f 95 266 96
f 104 103 267
f 104 248 91
f 104 267 248
f 267 268 248
f 249 248 269
f 269 248 268
f 250 249 270
f 270 249 269
f 251 250 271
f 271 250 270
f 252 251 272
f 272 251 271
f 253 252 273
f 273 252 272
f 254 253 274
f 274 253 273
f 255 254 275
f 275 254 274
f 257 255 276
f 276 255 275
f 277 258 257
f 277 257 278
f 278 257 276
f 278 279 280
f 277 278 280
f 280 279 281
f 282 283 284
f 282 285 286
f 283 282 286
f 285 287 288
f 286 285 288
f 288 287 289
f 262 261 290
f 290 291 292
f 290 292 262
f 262 292 263
f 264 263 293
f 293 263 292
f 265 264 294
f 294 264 293
f 266 265 295
f 295 265 294
f 96 296 105
f 96 266 296
f 266 295 296
f 105 297 106
f 296 297 105
f 106 298 107
f 297 298 106
f 107 299 108
f 298 299 107
f 108 300 109
f 299 300 108
f 109 301 110
f 300 301 109
f 110 267 103
f 110 301 267
f 301 302 267
f 268 267 303
f 303 267 302
f 269 268 304
f 304 268 303
f 270 269 305
f 305 269 304
f 271 270 306
f 306 270 305
f 272 271 307
f 307 271 306
f 273 272 308
f 308 272 307
f 274 273 309
f 309 273 308
f 275 274 310
f 310 274 309
f 276 275 311
f 311 275 310
f 278 276 312
f 312 276 311
f 279 278 313
f 313 278 312
f 314 281 279
f 314 279 315
f 315 279 313
f 315 316 317
f 314 315 317
f 316 318 319
f 317 316 319
f 319 318 320
f 321 322 323
f 284 322 321
f 284 321 282
f 282 321 324
f 285 282 325
f 325 282 324
f 287 285 326
f 326 285 325
f 327 289 287
f 327 287 328
f 328 287 326
f 328 329 330
f 327 328 330
f 329 331 332
f 330 329 332
f 331 333 334
f 332 331 334
f 334 333 335
f 292 291 336
f 293 292 336
f 337 293 336
f 337 338 339
f 337 339 293
f 293 339 294
f 295 294 340
f 340 294 339
f 296 295 341
f 341 295 340
f 297 296 342
f 342 296 341
f 298 297 343
f 343 297 342
f 299 298 344
f 344 298 343
f 300 299 345
f 345 299 344
f 301 300 346
f 346 300 345
f 347 348 302
f 347 302 346
f 346 302 301
f 303 302 348
f 349 303 348
f 304 303 349
f 350 304 349
f 305 304 350
f 351 305 350
f 306 305 351
f 352 306 351
f 307 306 352
f 353 307 352
f 353 354 355
f 353 355 307
f 307 355 308
f 309 308 356
f 356 308 355
f 310 309 357
f 357 309 356
f 311 310 358
f 358 310 357
f 312 311 359
f 359 311 358
f 313 312 360
f 360 312 359
f 315 313 361
f 361 313 360
f 316 315 362
f 362 315 361
f 318 316 363
f 363 316 362
f 364 320 318
f 364 318 365
f 365 318 363
f 365 366 367
f 364 365 367
f 366 368 369
f 367 366 369
f 323 369 368
f 323 368 321
f 321 368 370
f 324 321 371
f 371 321 370
f 325 324 372
f 372 324 371
f 326 325 373
f 373 325 372
f 328 326 374
f 374 326 373
f 329 328 375
f 375 328 374
f 331 329 376
f 376 329 375
f 333 331 377
f 377 331 376
f 378 335 333
f 378 333 379
f 379 333 377
f 379 380 381
f 378 379 381
f 381 380 382
f 339 338 383
f 340 339 383
f 384 340 383
f 341 340 384
f 385 341 384
f 342 341 385
f 386 342 385
f 343 342 386
f 387 343 386
f 344 343 387
f 388 344 387
f 345 344 388
f 389 345 388
f 346 345 389
f 390 346 389
f 347 346 390
f 355 354 391
f 356 355 391
f 392 356 391
f 392 393 394
f 392 394 356
f 356 394 357
f 358 357 395
f 395 357 394
f 359 358 396
f 396 358 395
f 360 359 397
f 397 359 396
f 361 360 398
f 398 360 397
f 362 361 399
f 399 361 398
f 363 362 400
f 400 362 399
f 365 363 401
f 401 363 400
f 366 365 402
f 402 365 401
f 368 366 403
f 403 366 402
f 370 368 404
f 404 368 403
f 371 370 405
f 405 370 404
f 372 371 406
f 406 371 405
f 373 372 407
f 407 372 406
f 374 373 408
f 408 373 407
f 375 374 409
f 409 374 408
f 376 375 410
f 410 375 409
f 377 376 411
f 411 376 410
f 379 377 412
f 412 377 411
f 380 379 413
f 413 379 412
f 414 382 380
f 414 380 415
f 415 380 413
f 415 416 417
f 414 415 417
f 416 418 419
f 417 416 419
f 419 418 420
f 394 393 421
f 395 394 421
f 422 395 421
f 422 423 424
f 422 424 395
f 395 424 396
f 397 396 425
f 425 396 424
f 398 397 426
f 426 397 425
f 399 398 427
f 427 398 426
f 400 399 428
f 428 399 427
f 401 400 429
f 429 400 428
f 402 401 430
f 430 401 429
f 403 402 431
f 431 402 430
f 404 403 432
f 432 403 431
f 405 404 433
f 433 404 432
f 406 405 434
f 434 405 433
f 407 406 435
f 435 406 434
f 408 407 436
f 436 407 435
f 409 408 437
f 437 408 436
f 410 409 438
f 438 409 437
f 411 410 439
f 439 410 438
f 412 411 440
f 440 411 439
f 413 412 441
f 441 412 440
f 415 413 442
f 442 413 441
f 416 415 443
f 443 415 442
f 418 416 444
f 444 416 443
f 445 420 418
f 445 418 446
f 446 418 444
f 446 447 448
f 445 446 448
f 448 447 449
f 424 423 450
f 425 424 450
f 451 425 450
f 426 425 451
f 452 426 451
f 452 453 454
f 452 454 426
f 426 454 427
f 428 427 455
f 455 427 454
f 429 428 456
f 456 428 455
f 430 429 457
f 457 429 456
f 431 430 458
f 458 430 457
f 432 431 459
f 459 431 458
f 433 432 460
f 460 432 459
f 434 433 461
f 461 433 460
f 435 434 462
f 462 434 461
f 436 435 463
f 463 435 462
f 437 436 464
f 464 436 463
f 465 466 438
f 465 438 464
f 464 438 437
f 439 438 466
f 467 439 466
f 467 468 469
f 467 469 439
f 439 469 440
f 441 440 470
f 470 440 469
f 442 441 471
f 471 441 470
f 443 442 472
f 472 442 471
f 444 443 473
f 473 443 472
f 446 444 474
f 474 444 473
f 447 446 475
f 475 446 474
f 476 449 447
f 476 447 477
f 477 447 475
f 477 478 479
f 476 477 479
f 478 480 481
f 479 478 481
f 480 482 483
f 481 480 483
f 482 484 485
f 483 482 485
f 484 486 487
f 485 484 487
f 487 486 488
f 454 453 489
f 455 454 489
f 490 455 489
f 456 455 490
f 491 456 490
f 457 456 491
f 492 457 491
f 458 457 492
f 493 458 492
f 459 458 493
f 494 459 493
f 460 459 494
f 495 460 494
f 461 460 495
f 496 461 495
f 462 461 496
f 497 462 496
f 463 462 497
f 498 463 497
f 464 463 498
f 499 464 498
f 465 464 499
f 469 468 500
f 470 469 500
f 501 470 500
f 471 470 501
f 502 471 501
f 472 471 502
f 503 472 502
f 503 504 505
f 503 505 472
f 472 505 473
f 474 473 506
f 506 473 505
f 475 474 507
f 507 474 506
f 477 475 508
f 508 475 507
f 478 477 509
f 509 477 508
f 480 478 510
f 510 478 509
f 482 480 511
f 511 480 510
f 484 482 512
f 512 482 511
f 486 484 513
f 513 484 512
f 514 488 486
f 513 514 486
f 505 504 515
f 506 505 515
f 516 506 515
f 507 506 516
f 517 507 516
f 508 507 517
f 518 508 517
f 509 508 518
f 519 509 518
f 510 509 519
f 520 510 519
f 511 510 520
f 521 511 520
f 512 511 521
f 522 512 521
f 513 512 522
f 523 513 522
f 514 513 523
f 112 524 525
f 113 112 525
f 115 526 112
f 112 526 524
f 117 527 115
f 115 527 526
f 119 528 117
f 117 528 527
f 121 529 119
f 119 529 528
f 123 530 121
f 121 530 529
f 125 531 123
f 123 531 530
f 531 125 126
f 532 531 126
f 128 533 534
f 129 128 534
f 525 128 113
f 533 128 525
f 126 535 532
f 137 535 126
f 140 536 137
f 137 536 535
f 536 140 141
f 537 536 141
f 143 538 539
f 144 143 539
f 534 143 129
f 538 143 534
f 141 540 537
f 155 540 141
f 158 541 155
f 155 541 540
f 541 158 159
f 542 541 159
f 161 543 544
f 162 161 544
f 539 161 144
f 543 161 539
f 159 545 542
f 172 545 159
f 545 172 174
f 546 545 174
f 162 544 176
f 544 547 176
f 174 548 546
f 184 548 174
f 548 184 186
f 549 548 186
f 176 547 188
f 547 550 188
f 186 551 549
f 195 551 186
f 551 195 197
f 552 551 197
f 188 550 553
f 198 188 553
f 553 199 198
f 554 199 553
f 197 555 552
f 206 555 197
f 208 556 557
f 208 557 206
f 206 557 555
f 556 558 559
f 557 556 559
f 559 558 560
f 199 554 561
f 209 199 561
f 561 210 209
f 562 210 561
f 208 216 556
f 219 556 216
f 558 556 219
f 558 563 560
f 558 219 563
f 219 221 563
f 223 564 221
f 221 564 563
f 225 565 223
f 223 565 564
f 227 566 225
f 225 566 565
f 566 227 228
f 567 566 228
f 210 562 230
f 562 568 230
f 228 569 567
f 240 569 228
f 242 570 571
f 242 571 240
f 240 571 569
f 570 572 573
f 571 570 573
f 572 574 575
f 573 572 575
f 575 574 576
f 230 568 577
f 243 230 577
f 577 244 243
f 578 244 577
f 242 256 570
f 258 570 256
f 258 579 570
f 579 572 570
f 574 572 580
f 580 572 579
f 581 576 574
f 581 574 582
f 582 574 580
f 581 582 583
f 244 578 584
f 259 244 584
f 260 259 585
f 259 584 585
f 585 261 260
f 586 261 585
f 258 277 579
f 280 579 277
f 580 579 280
f 281 580 280
f 281 587 580
f 587 582 580
f 588 583 582
f 588 582 589
f 589 582 587
f 588 589 590
f 283 591 592
f 284 283 592
f 286 593 283
f 283 593 591
f 288 594 286
f 286 594 593
f 594 288 289
f 595 594 289
f 261 586 596
f 290 261 596
f 596 291 290
f 597 291 596
f 598 599 600
f 600 601 598
f 281 314 587
f 317 587 314
f 589 587 317
f 589 602 590
f 589 317 602
f 317 319 602
f 320 603 604
f 320 604 319
f 319 604 602
f 603 605 606
f 604 603 606
f 606 605 607
f 322 608 609
f 323 322 609
f 592 322 284
f 608 322 592
f 289 610 595
f 327 610 289
f 611 612 610
f 611 610 330
f 330 610 327
f 330 332 613
f 611 330 613
f 332 334 614
f 613 332 614
f 334 335 614
f 291 597 615
f 336 291 615
f 337 336 616
f 336 615 616
f 616 338 337
f 617 338 616
f 348 618 619
f 347 618 348
f 349 348 620
f 348 619 620
f 350 349 621
f 349 620 621
f 351 350 622
f 350 621 622
f 352 351 623
f 351 622 623
f 599 598 353
f 599 353 623
f 623 353 352
f 354 624 625
f 353 624 354
f 353 601 624
f 353 598 601
f 625 626 627
f 624 626 625
f 627 628 629
f 626 628 627
f 628 630 629
f 320 364 603
f 367 603 364
f 605 603 367
f 605 631 607
f 605 367 631
f 367 369 631
f 609 369 323
f 631 369 609
f 611 632 612
f 632 633 634
f 632 611 633
f 611 613 633
f 614 635 613
f 635 633 613
f 335 378 636
f 335 636 614
f 614 636 635
f 378 381 637
f 636 378 637
f 381 382 637
f 338 617 638
f 383 338 638
f 384 383 639
f 383 638 639
f 385 384 640
f 384 639 640
f 386 385 641
f 385 640 641
f 387 386 642
f 386 641 642
f 388 387 643
f 387 642 643
f 389 388 644
f 388 643 644
f 390 389 645
f 389 644 645
f 618 347 390
f 645 618 390
f 354 625 391
f 392 391 625
f 627 392 625
f 393 392 627
f 393 627 646
f 646 627 629
f 647 629 630
f 647 648 629
f 648 646 629
f 647 649 648
f 633 650 634
f 635 650 633
f 651 650 635
f 651 652 653
f 651 635 652
f 635 636 652
f 637 654 636
f 654 652 636
f 382 414 655
f 382 655 637
f 637 655 654
f 414 417 656
f 655 414 656
f 417 419 657
f 656 417 657
f 419 420 657
f 393 646 421
f 422 421 646
f 648 422 646
f 423 658 659
f 422 658 423
f 422 649 658
f 422 648 649
f 659 660 661
f 658 660 659
f 660 662 661
f 652 663 653
f 654 663 652
f 664 663 654
f 664 665 666
f 664 654 665
f 654 655 665
f 656 667 655
f 667 665 655
f 657 668 656
f 668 667 656
f 420 445 669
f 420 669 657
f 657 669 668
f 445 448 670
f 669 445 670
f 448 449 670
f 423 659 450
f 451 450 659
f 661 451 659
f 661 662 671
f 661 671 451
f 451 671 452
f 453 672 673
f 453 452 672
f 452 671 672
f 673 674 675
f 672 674 673
f 674 676 675
f 466 677 678
f 465 677 466
f 467 466 679
f 466 678 679
f 679 468 467
f 680 468 679
f 665 681 666
f 667 681 665
f 682 681 667
f 682 683 684
f 682 667 683
f 667 668 683
f 669 685 668
f 685 683 668
f 670 686 669
f 686 685 669
f 449 476 687
f 449 687 670
f 670 687 686
f 476 479 688
f 687 476 688
f 479 481 689
f 688 479 689
f 481 483 690
f 689 481 690
f 483 485 691
f 690 483 691
f 485 487 692
f 691 485 692
f 487 488 692
f 453 673 489
f 490 489 673
f 675 490 673
f 675 676 693
f 675 693 490
f 490 693 491
f 492 491 694
f 491 693 694
f 493 492 695
f 492 694 695
f 494 493 696
f 493 695 696
f 495 494 697
f 494 696 697
f 496 495 698
f 495 697 698
f 497 496 699
f 496 698 699
f 498 497 700
f 497 699 700
f 499 498 701
f 498 700 701
f 677 465 499
f 701 677 499
f 468 680 702
f 500 468 702
f 501 500 703
f 500 702 703
f 502 501 704
f 501 703 704
f 503 502 705
f 502 704 705
f 705 683 503
f 705 684 683
f 503 683 504
f 706 707 683
f 504 683 707
f 685 706 683
f 708 706 685
f 686 708 685
f 709 708 686
f 687 709 686
f 710 709 687
f 688 710 687
f 711 710 688
f 711 712 713
f 711 688 712
f 688 689 712
f 690 714 689
f 714 712 689
f 691 715 690
f 715 714 690
f 692 716 691
f 716 715 691
f 488 514 716
f 692 488 716
f 504 707 717
f 515 504 717
f 516 515 718
f 515 717 718
f 517 516 719
f 516 718 719
f 518 517 720
f 517 719 720
f 519 518 721
f 518 720 721
f 713 712 520
f 713 520 721
f 721 520 519
f 521 520 712
f 714 521 712
f 522 521 714
f 715 522 714
f 523 522 715
f 716 523 715
f 514 523 716
f 722 723 724
f 722 725 726
f 723 722 726
f 725 727 728
f 726 725 728
f 727 729 730
f 728 727 730
f 730 729 731
f 732 722 724
f 733 732 724
f 725 722 734
f 734 722 732
f 727 725 735
f 735 725 734
f 729 727 736
f 736 727 735
f 737 731 729
f 737 729 738
f 738 729 736
f 738 739 740
f 737 738 740
f 740 739 741
f 742 732 733
f 743 742 733
f 734 732 744
f 744 732 742
f 735 734 745
f 745 734 744
f 736 735 746
f 746 735 745
f 738 736 747
f 747 736 746
f 739 738 748
f 748 738 747
f 749 741 739
f 749 739 750
f 750 739 748
f 750 751 752
f 749 750 752
f 751 753 754
f 752 751 754
f 754 753 755
f 756 742 743
f 757 756 743
f 744 742 758
f 758 742 756
f 745 744 759
f 759 744 758
f 746 745 760
f 760 745 759
f 747 746 761
f 761 746 760
f 748 747 762
f 762 747 761
f 750 748 763
f 763 748 762
f 751 750 764
f 764 750 763
f 753 751 765
f 765 751 764
f 766 755 753
f 766 753 767
f 767 753 765
f 767 768 769
f 766 767 769
f 768 770 771
f 769 768 771
f 771 770 772
f 773 756 757
f 774 773 757
f 758 756 775
f 775 756 773
f 759 758 776
f 776 758 775
f 760 759 777
f 777 759 776
f 761 760 778
f 778 760 777
f 762 761 779
f 779 761 778
f 763 762 780
f 780 762 779
f 764 763 781
f 781 763 780
f 765 764 782
f 782 764 781
f 767 765 783
f 783 765 782
f 768 767 784
f 784 767 783
f 770 768 785
f 785 768 784
f 786 772 770
f 786 770 787
f 787 770 785
f 786 787 788
f 789 773 774
f 790 789 774
f 775 773 791
f 791 773 789
f 776 775 792
f 792 775 791
f 777 776 793
f 793 776 792
f 778 777 794
f 794 777 793
f 779 778 795
f 795 778 794
f 780 779 796
f 796 779 795
f 781 780 797
f 797 780 796
f 782 781 798
f 798 781 797
f 783 782 799
f 799 782 798
f 784 783 800
f 800 783 799
f 785 784 801
f 801 784 800
f 787 785 802
f 802 785 801
f 803 788 787
f 803 787 804
f 804 787 802
f 803 804 805
f 789 790 806
f 806 807 808
f 806 808 789
f 789 808 791
f 792 791 809
f 809 791 808
f 793 792 810
f 810 792 809
f 794 793 811
f 811 793 810
f 795 794 812
f 812 794 811
f 796 795 813
f 813 795 812
f 797 796 814
f 814 796 813
f 798 797 815
f 815 797 814
f 799 798 816
f 816 798 815
f 800 799 817
f 817 799 816
f 801 800 818
f 818 800 817
f 802 801 819
f 819 801 818
f 804 802 820
f 820 802 819
f 821 805 804
f 821 804 822
f 822 804 820
f 821 822 823
f 824 808 807
f 825 824 807
f 809 808 826
f 826 808 824
f 810 809 827
f 827 809 826
f 811 810 828
f 828 810 827
f 812 811 829
f 829 811 828
f 813 812 830
f 830 812 829
f 814 813 831
f 831 813 830
f 524 831 525
f 524 815 831
f 815 814 831
f 526 815 524
f 816 815 526
f 527 816 526
f 817 816 527
f 528 817 527
f 818 817 528
f 529 818 528
f 819 818 529
f 530 819 529
f 820 819 530
f 531 820 530
f 822 820 531
f 822 531 532
f 822 532 823
f 823 532 832
f 824 825 833
f 833 834 835
f 833 835 824
f 824 835 826
f 827 826 836
f 836 826 835
f 828 827 837
f 837 827 836
f 829 828 838
f 838 828 837
f 830 829 839
f 839 829 838
f 533 839 534
f 533 831 839
f 831 830 839
f 525 831 533
f 532 840 832
f 535 840 532
f 536 841 535
f 535 841 840
f 841 536 537
f 842 841 537
f 843 835 834
f 844 843 834
f 836 835 845
f 845 835 843
f 837 836 846
f 846 836 845
f 838 837 847
f 847 837 846
f 538 847 539
f 538 839 847
f 839 838 847
f 534 839 538
f 537 848 842
f 540 848 537
f 849 850 848
f 849 848 541
f 541 848 540
f 541 542 849
f 843 844 851
f 851 852 853
f 851 853 843
f 843 853 845
f 846 845 854
f 854 845 853
f 543 854 544
f 543 847 854
f 847 846 854
f 539 847 543
f 855 850 849
f 856 850 855
f 542 545 857
f 542 857 849
f 849 857 855
f 545 546 857
f 858 853 852
f 859 858 852
f 854 853 860
f 860 853 858
f 544 860 547
f 854 860 544
f 855 861 856
f 861 862 863
f 861 855 862
f 855 857 862
f 546 548 864
f 546 864 857
f 857 864 862
f 548 549 864
f 858 859 865
f 865 866 867
f 865 867 858
f 858 867 860
f 547 867 550
f 860 867 547
f 862 868 863
f 868 869 870
f 868 862 869
f 862 864 869
f 549 551 871
f 549 871 864
f 864 871 869
f 551 552 871
f 867 866 872
f 873 872 874
f 553 872 873
f 553 867 872
f 553 550 867
f 553 873 554
f 875 870 869
f 876 870 875
f 871 877 869
f 877 875 869
f 552 555 878
f 552 878 871
f 871 878 877
f 555 557 879
f 878 555 879
f 557 559 880
f 879 557 880
f 559 560 880
f 873 874 881
f 882 881 883
f 561 881 882
f 561 873 881
f 561 554 873
f 561 882 562
f 884 876 875
f 885 876 884
f 877 886 875
f 886 884 875
f 878 887 877
f 887 886 877
f 879 888 878
f 888 887 878
f 880 889 879
f 889 888 879
f 560 563 890
f 560 890 880
f 880 890 889
f 563 564 891
f 890 563 891
f 564 565 892
f 891 564 892
f 565 566 893
f 892 565 893
f 566 567 893
f 882 883 894
f 882 568 562
f 882 895 568
f 882 894 895
f 896 568 895
f 895 897 896
f 898 885 884
f 899 885 898
f 886 900 884
f 900 898 884
f 887 901 886
f 901 900 886
f 888 902 887
f 902 901 887
f 889 903 888
f 903 902 888
f 890 904 889
f 904 903 889
f 891 905 890
f 905 904 890
f 892 906 891
f 906 905 891
f 893 907 892
f 907 906 892
f 567 569 908
f 567 908 893
f 893 908 907
f 569 571 909
f 908 569 909
f 571 573 910
f 909 571 910
f 573 575 911
f 910 573 911
f 575 576 911
f 568 896 577
f 578 912 913
f 577 912 578
f 577 897 912
f 577 896 897
f 912 914 913
f 915 916 917
f 899 915 917
f 899 898 915
f 898 918 915
f 900 919 898
f 919 918 898
f 901 920 900
f 920 919 900
f 902 921 901
f 921 920 901
f 903 922 902
f 922 921 902
f 904 923 903
f 923 922 903
f 905 924 904
f 924 923 904
f 906 925 905
f 925 924 905
f 907 926 906
f 926 925 906
f 908 927 907
f 927 926 907
f 909 928 908
f 928 927 908
f 910 929 909
f 929 928 909
f 911 930 910
f 930 929 910
f 576 581 931
f 576 931 911
f 911 931 930
f 581 583 931
f 578 913 584
f 913 914 932
f 913 932 584
f 584 932 585
f 586 933 934
f 586 585 933
f 585 932 933
f 933 935 934
f 936 937 938
f 916 936 938
f 916 915 936
f 915 939 936
f 918 940 915
f 940 939 915
f 919 941 918
f 941 940 918
f 920 942 919
f 942 941 919
f 921 943 920
f 943 942 920
f 922 944 921
f 944 943 921
f 923 945 922
f 945 944 922
f 924 946 923
f 946 945 923
f 925 947 924
f 947 946 924
f 926 948 925
f 948 947 925
f 927 949 926
f 949 948 926
f 928 950 927
f 950 949 927
f 929 951 928
f 951 950 928
f 930 952 929
f 952 951 929
f 931 953 930
f 953 952 930
f 583 588 954
f 583 954 931
f 931 954 953
f 588 590 954
f 591 955 592
f 591 593 956
f 955 591 956
f 593 594 957
f 956 593 957
f 594 595 957
f 586 934 596
f 597 958 959
f 596 958 597
f 596 935 958
f 596 934 935
f 959 960 961
f 958 960 959
f 960 962 961
f 963 964 965
f 937 963 965
f 937 936 963
f 936 966 963
f 939 967 936
f 967 966 936
f 940 968 939
f 968 967 939
f 941 969 940
f 969 968 940
f 942 970 941
f 970 969 941
f 943 971 942
f 971 970 942
f 944 972 943
f 972 971 943
f 945 973 944
f 973 972 944
f 600 599 973
f 600 973 946
f 946 973 945
f 601 600 946
f 601 946 974
f 974 946 947
f 948 975 947
f 975 974 947
f 949 976 948
f 976 975 948
f 950 977 949
f 977 976 949
f 951 978 950
f 978 977 950
f 952 979 951
f 979 978 951
f 953 980 952
f 980 979 952
f 954 981 953
f 981 980 953
f 590 602 982
f 590 982 954
f 954 982 981
f 602 604 983
f 982 602 983
f 604 606 984
f 983 604 984
f 606 607 984
f 608 985 609
f 608 592 955
f 608 955 985
f 985 955 986
f 956 987 955
f 987 986 955
f 957 988 956
f 988 987 956
f 595 610 989
f 595 989 957
f 957 989 988
f 610 612 989
f 597 959 615
f 616 615 959
f 961 616 959
f 617 990 991
f 616 990 617
f 616 962 990
f 616 961 962
f 990 992 991
f 993 994 995
f 964 993 995
f 964 963 993
f 963 996 993
f 966 997 963
f 997 996 963
f 967 998 966
f 998 997 966
f 968 999 967
f 999 998 967
f 619 618 999
f 619 999 969
f 969 999 968
f 620 619 969
f 970 620 969
f 621 620 970
f 971 621 970
f 622 621 971
f 972 622 971
f 623 622 972
f 973 623 972
f 599 623 973
f 601 974 624
f 626 624 974
f 975 626 974
f 628 626 975
f 976 628 975
f 630 628 976
f 630 976 1000
f 1000 976 977
f 978 1001 977
f 1001 1000 977
f 979 1002 978
f 1002 1001 978
f 980 1003 979
f 1003 1002 979
f 981 1004 980
f 1004 1003 980
f 982 1005 981
f 1005 1004 981
f 983 1006 982
f 1006 1005 982
f 984 1007 983
f 1007 1006 983
f 607 631 1008
f 607 1008 984
f 984 1008 1007
f 631 609 985
f 631 985 1008
f 1008 985 1009
f 986 1010 985
f 1010 1009 985
f 987 1011 986
f 1011 1010 986
f 988 1012 987
f 1012 1011 987
f 989 1013 988
f 1013 1012 988
f 612 632 1014
f 612 1014 989
f 989 1014 1013
f 632 634 1014
f 617 991 638
f 991 992 1015
f 991 1015 638
f 638 1015 639
f 640 639 1016
f 639 1015 1016
f 994 993 641
f 994 641 1016
f 1016 641 640
f 642 641 993
f 996 642 993
f 643 642 996
f 997 643 996
f 644 643 997
f 998 644 997
f 645 644 998
f 999 645 998
f 618 645 999
f 630 1000 647
f 649 647 1000
f 649 1000 1017
f 1017 1000 1001
f 1002 1018 1001
f 1018 1017 1001
f 1003 1019 1002
f 1019 1018 1002
f 1004 1020 1003
f 1020 1019 1003
f 1005 1021 1004
f 1021 1020 1004
f 1006 1022 1005
f 1022 1021 1005
f 1007 1023 1006
f 1023 1022 1006
f 1008 1024 1007
f 1024 1023 1007
f 1009 1025 1008
f 1025 1024 1008
f 1010 1026 1009
f 1026 1025 1009
f 1011 1027 1010
f 1027 1026 1010
f 1012 1028 1011
f 1028 1027 1011
f 1013 1029 1012
f 1029 1028 1012
f 1014 1030 1013
f 1030 1029 1013
f 634 650 1031
f 634 1031 1014
f 1014 1031 1030
f 650 651 1032
f 1031 650 1032
f 651 653 1032
f 649 1017 658
f 660 658 1017
f 1018 660 1017
f 662 660 1018
f 662 1018 1033
f 1033 1018 1019
f 1020 1034 1019
f 1034 1033 1019
f 1021 1035 1020
f 1035 1034 1020
f 1022 1036 1021
f 1036 1035 1021
f 1023 1037 1022
f 1037 1036 1022
f 1024 1038 1023
f 1038 1037 1023
f 1025 1039 1024
f 1039 1038 1024
f 1026 1040 1025
f 1040 1039 1025
f 1027 1041 1026
f 1041 1040 1026
f 1028 1042 1027
f 1042 1041 1027
f 1029 1043 1028
f 1043 1042 1028
f 1030 1044 1029
f 1044 1043 1029
f 1031 1045 1030
f 1045 1044 1030
f 1032 1046 1031
f 1046 1045 1031
f 653 663 1047
f 653 1047 1032
f 1032 1047 1046
f 663 664 1048
f 1047 663 1048
f 664 666 1048
f 662 1033 671
f 672 671 1033
f 1034 672 1033
f 674 672 1034
f 1035 674 1034
f 676 674 1035
f 676 1035 1049
f 1049 1035 1036
f 1037 1050 1036
f 1050 1049 1036
f 1038 1051 1037
f 1051 1050 1037
f 1039 1052 1038
f 1052 1051 1038
f 1040 1053 1039
f 1053 1052 1039
f 1041 1054 1040
f 1054 1053 1040
f 1042 1055 1041
f 1055 1054 1041
f 1043 1056 1042
f 1056 1055 1042
f 1044 1057 1043
f 1057 1056 1043
f 678 677 1057
f 678 1057 1045
f 1045 1057 1044
f 679 678 1045
f 1046 679 1045
f 680 679 1046
f 680 1046 1058
f 1058 1046 1047
f 1048 1059 1047
f 1059 1058 1047
f 666 681 1060
f 666 1060 1048
f 1048 1060 1059
f 681 682 1061
f 1060 681 1061
f 682 684 1061
f 676 1049 693
f 694 693 1049
f 1050 694 1049
f 695 694 1050
f 1051 695 1050
f 696 695 1051
f 1052 696 1051
f 697 696 1052
f 1053 697 1052
f 698 697 1053
f 1054 698 1053
f 699 698 1054
f 1055 699 1054
f 700 699 1055
f 1056 700 1055
f 701 700 1056
f 1057 701 1056
f 677 701 1057
f 680 1058 702
f 703 702 1058
f 1059 703 1058
f 704 703 1059
f 1060 704 1059
f 705 704 1060
f 1061 705 1060
f 684 705 1061
f 706 1062 707
f 706 708 1063
f 1062 706 1063
f 708 709 1064
f 1063 708 1064
f 709 710 1065
f 1064 709 1065
f 710 711 1066
f 1065 710 1066
f 711 713 1066
f 707 1062 717
f 718 717 1062
f 1063 718 1062
f 719 718 1063
f 1064 719 1063
f 720 719 1064
f 1065 720 1064
f 721 720 1065
f 1066 721 1065
f 713 721 1066
f 1067 1068 1069
f 1067 1070 1071
f 1068 1067 1071
f 1071 1070 1072
f 1073 1074 1075
f 1069 1074 1073
f 1069 1073 1067
f 1067 1073 1076
f 1070 1067 1077
f 1077 1067 1076
f 1078 1072 1070
f 1078 1070 1079
f 1079 1070 1077
f 1079 1080 1081
f 1078 1079 1081
f 1081 1080 1082
f 1083 1073 1075
f 1084 1083 1075
f 1076 1073 1085
f 1085 1073 1083
f 1077 1076 1086
f 1086 1076 1085
f 1079 1077 1087
f 1087 1077 1086
f 1080 1079 1088
f 1088 1079 1087
f 1089 1082 1080
f 1089 1080 1090
f 1090 1080 1088
f 1090 1091 1092
f 1089 1090 1092
f 1091 1093 1094
f 1092 1091 1094
f 1094 1093 1095
f 1083 1084 1096
f 1096 1097 1098
f 1096 1098 1083
f 1083 1098 1085
f 1086 1085 1099
f 1099 1085 1098
f 1087 1086 1100
f 1100 1086 1099
f 1088 1087 1101
f 1101 1087 1100
f 1090 1088 1102
f 1102 1088 1101
f 1091 1090 1103
f 1103 1090 1102
f 1093 1091 1104
f 1104 1091 1103
f 1105 1095 1093
f 1105 1093 1106
f 1106 1093 1104
f 1106 724 723
f 1106 723 1105
f 1105 723 1107
f 726 1108 723
f 723 1108 1107
f 728 1109 726
f 726 1109 1108
f 730 1110 728
f 728 1110 1109
f 1110 730 731
f 1111 1110 731
f 1098 1097 1112
f 1112 1113 1114
f 1112 1114 1098
f 1098 1114 1099
f 1100 1099 1115
f 1115 1099 1114
f 1101 1100 1116
f 1116 1100 1115
f 1102 1101 1117
f 1117 1101 1116
f 1103 1102 1118
f 1118 1102 1117
f 1104 1103 1119
f 1119 1103 1118
f 1106 1104 1120
f 1120 1104 1119
f 724 1120 733
f 1106 1120 724
f 731 1121 1111
f 737 1121 731
f 740 1122 737
f 737 1122 1121
f 1122 740 741
f 1123 1122 741
f 1114 1113 1124
f 1124 1125 1126
f 1124 1126 1114
f 1114 1126 1115
f 1116 1115 1127
f 1127 1115 1126
f 1117 1116 1128
f 1128 1116 1127
f 1118 1117 1129
f 1129 1117 1128
f 1119 1118 1130
f 1130 1118 1129
f 1120 1119 1131
f 1131 1119 1130
f 733 1131 743
f 1120 1131 733
f 741 1132 1123
f 749 1132 741
f 752 1133 749
f 749 1133 1132
f 754 1134 752
f 752 1134 1133
f 1134 754 755
f 1135 1134 755
f 1126 1125 1136
f 1127 1126 1136
f 1137 1127 1136
f 1137 1138 1139
f 1137 1139 1127
f 1127 1139 1128
f 1129 1128 1140
f 1140 1128 1139
f 1130 1129 1141
f 1141 1129 1140
f 1131 1130 1142
f 1142 1130 1141
f 743 1142 757
f 1131 1142 743
f 755 1143 1135
f 766 1143 755
f 769 1144 766
f 766 1144 1143
f 771 1145 769
f 769 1145 1144
f 1145 771 772
f 1146 1145 772
f 1139 1138 1147
f 1147 1148 1149
f 1147 1149 1139
f 1139 1149 1140
f 1141 1140 1150
f 1150 1140 1149
f 1142 1141 1151
f 1151 1141 1150
f 757 1151 774
f 1142 1151 757
f 772 1152 1146
f 786 1152 772
f 1152 786 788
f 1153 1152 788
f 1149 1148 1154
f 1154 1155 1156
f 1154 1156 1149
f 1149 1156 1150
f 1151 1150 1157
f 1157 1150 1156
f 774 1157 790
f 1151 1157 774
f 788 1158 1153
f 803 1158 788
f 1158 803 805
f 1159 1158 805
f 1156 1155 1160
f 1157 1156 1160
f 1161 1157 1160
f 1162 1161 1163
f 806 1161 1162
f 806 1157 1161
f 806 790 1157
f 806 1162 807
f 805 1164 1159
f 821 1164 805
f 1164 821 823
f 1165 1164 823
f 1162 1163 1166
f 1166 807 1162
f 1166 1167 807
f 1167 825 807
f 823 832 1165
f 1165 832 1168
f 825 1167 1169
f 833 825 1169
f 1169 834 833
f 1170 834 1169
f 832 1171 1168
f 840 1171 832
f 1172 1173 1171
f 1172 1171 841
f 841 1171 840
f 841 842 1172
f 834 1170 844
f 1170 1174 844
f 1175 1173 1172
f 1176 1173 1175
f 842 848 1177
f 842 1177 1172
f 1172 1177 1175
f 848 850 1177
f 844 1174 1178
f 851 844 1178
f 1178 852 851
f 1179 852 1178
f 1180 1176 1175
f 1181 1176 1180
f 1177 1182 1175
f 1182 1180 1175
f 850 856 1182
f 1177 850 1182
f 852 1179 859
f 1179 1183 859
f 1184 1181 1180
f 1185 1181 1184
f 1182 1186 1180
f 1186 1184 1180
f 856 861 1187
f 856 1187 1182
f 1182 1187 1186
f 861 863 1187
f 859 1183 1188
f 865 859 1188
f 1188 866 865
f 1189 866 1188
f 1190 1185 1184
f 1191 1185 1190
f 1186 1192 1184
f 1192 1190 1184
f 1187 1193 1186
f 1193 1192 1186
f 863 868 1194
f 863 1194 1187
f 1187 1194 1193
f 868 870 1194
f 866 1189 1195
f 872 866 1195
f 1195 874 872
f 1196 874 1195
f 1197 1191 1190
f 1198 1191 1197
f 1192 1199 1190
f 1199 1197 1190
f 1193 1200 1192
f 1200 1199 1192
f 1194 1201 1193
f 1201 1200 1193
f 870 876 1201
f 1194 870 1201
f 874 1196 1202
f 881 874 1202
f 1202 883 881
f 1203 883 1202
f 1204 1198 1197
f 1205 1198 1204
f 1199 1206 1197
f 1206 1204 1197
f 1200 1207 1199
f 1207 1206 1199
f 1201 1208 1200
f 1208 1207 1200
f 876 885 1208
f 1201 876 1208
f 883 1203 1209
f 894 883 1209
f 895 894 1210
f 894 1209 1210
f 1210 897 895
f 1211 897 1210
f 1212 1205 1204
f 1213 1205 1212
f 1206 1214 1204
f 1214 1212 1204
f 1207 1215 1206
f 1215 1214 1206
f 1208 1216 1207
f 1216 1215 1207
f 885 899 1216
f 1208 885 1216
f 897 1211 1217
f 912 897 1217
f 1217 914 912
f 1218 914 1217
f 1219 1220 1221
f 1213 1219 1221
f 1213 1212 1219
f 1212 1222 1219
f 1214 1223 1212
f 1223 1222 1212
f 1215 1224 1214
f 1224 1223 1214
f 917 916 1224
f 917 1224 1216
f 1216 1224 1215
f 899 917 1216
f 914 1218 1225
f 932 914 1225
f 933 932 1226
f 932 1225 1226
f 1226 935 933
f 1227 935 1226
f 1228 1229 1230
f 1220 1228 1230
f 1220 1219 1228
f 1219 1231 1228
f 1222 1232 1219
f 1232 1231 1219
f 1223 1233 1222
f 1233 1232 1222
f 938 937 1233
f 938 1233 1224
f 1224 1233 1223
f 916 938 1224
f 935 1227 1234
f 958 935 1234
f 960 958 1235
f 958 1234 1235
f 962 1236 1237
f 962 960 1236
f 960 1235 1236
f 1229 1237 1236
f 1229 1228 1237
f 1228 1238 1237
f 1231 1239 1228
f 1239 1238 1228
f 1232 1240 1231
f 1240 1239 1231
f 965 964 1240
f 965 1240 1233
f 1233 1240 1232
f 937 965 1233
f 962 1237 990
f 992 990 1237
f 992 1237 1241
f 1241 1237 1238
f 1239 1242 1238
f 1242 1241 1238
f 995 994 1242
f 995 1242 1240
f 1240 1242 1239
f 964 995 1240
f 992 1241 1015
f 1016 1015 1241
f 1242 1016 1241
f 994 1016 1242
f 1068 1243 1069
f 1068 1071 1244
f 1243 1068 1244
f 1071 1072 1244
f 1074 1245 1075
f 1074 1069 1243
f 1074 1243 1245
f 1245 1243 1246
f 1244 1247 1243
f 1247 1246 1243
f 1072 1078 1248
f 1072 1248 1244
f 1244 1248 1247
f 1078 1081 1249
f 1248 1078 1249
f 1081 1082 1249
f 1245 1250 1084
f 1075 1245 1084
f 1246 1251 1245
f 1251 1250 1245
f 1247 1252 1246
f 1252 1251 1246
f 1248 1253 1247
f 1253 1252 1247
f 1249 1254 1248
f 1254 1253 1248
f 1082 1089 1255
f 1082 1255 1249
f 1249 1255 1254
f 1089 1092 1256
f 1255 1089 1256
f 1092 1094 1257
f 1256 1092 1257
f 1094 1095 1257
f 1084 1250 1096
f 1097 1096 1250
f 1097 1250 1258
f 1258 1250 1251
f 1252 1259 1251
f 1259 1258 1251
f 1253 1260 1252
f 1260 1259 1252
f 1254 1261 1253
f 1261 1260 1253
f 1255 1262 1254
f 1262 1261 1254
f 1256 1263 1255
f 1263 1262 1255
f 1257 1264 1256
f 1264 1263 1256
f 1095 1105 1265
f 1095 1265 1257
f 1257 1265 1264
f 1266 1265 1105
f 1266 1105 1267
f 1267 1105 1107
f 1108 1268 1107
f 1107 1268 1267
f 1109 1269 1108
f 1108 1269 1268
f 1110 1270 1109
f 1109 1270 1269
f 1270 1110 1111
f 1271 1270 1111
f 1097 1258 1112
f 1113 1112 1258
f 1113 1258 1272
f 1272 1258 1259
f 1260 1273 1259
f 1273 1272 1259
f 1261 1274 1260
f 1274 1273 1260
f 1262 1275 1261
f 1275 1274 1261
f 1263 1276 1262
f 1276 1275 1262
f 1264 1277 1263
f 1277 1276 1263
f 1265 1278 1264
f 1278 1277 1264
f 1279 1265 1266
f 1278 1265 1279
f 1111 1280 1271
f 1121 1280 1111
f 1122 1281 1121
f 1121 1281 1280
f 1281 1122 1123
f 1282 1281 1123
f 1113 1272 1124
f 1125 1124 1272
f 1125 1272 1283
f 1283 1272 1273
f 1274 1284 1273
f 1284 1283 1273
f 1275 1285 1274
f 1285 1284 1274
f 1276 1286 1275
f 1286 1285 1275
f 1277 1287 1276
f 1287 1286 1276
f 1278 1288 1277
f 1288 1287 1277
f 1289 1278 1279
f 1288 1278 1289
f 1123 1290 1282
f 1132 1290 1123
f 1133 1291 1132
f 1132 1291 1290
f 1292 1293 1291
f 1292 1291 1134
f 1134 1291 1133
f 1134 1135 1292
f 1125 1283 1136
f 1137 1136 1283
f 1284 1137 1283
f 1138 1137 1284
f 1138 1284 1294
f 1294 1284 1285
f 1286 1295 1285
f 1295 1294 1285
f 1287 1296 1286
f 1296 1295 1286
f 1288 1297 1287
f 1297 1296 1287
f 1298 1288 1289
f 1297 1288 1298
f 1292 1299 1293
f 1300 1301 1299
f 1143 1300 1299
f 1143 1299 1292
f 1143 1292 1135
f 1143 1144 1302
f 1300 1143 1302
f 1144 1145 1303
f 1302 1144 1303
f 1145 1146 1303
f 1138 1294 1147
f 1148 1147 1294
f 1148 1294 1304
f 1304 1294 1295
f 1296 1305 1295
f 1305 1304 1295
f 1297 1306 1296
f 1306 1305 1296
f 1307 1297 1298
f 1306 1297 1307
f 1300 1308 1301
f 1308 1309 1310
f 1308 1300 1309
f 1300 1302 1309
f 1303 1311 1302
f 1311 1309 1302
f 1146 1152 1312
f 1146 1312 1303
f 1303 1312 1311
f 1152 1153 1312
f 1148 1304 1154
f 1155 1154 1304
f 1155 1304 1313
f 1313 1304 1305
f 1306 1314 1305
f 1314 1313 1305
f 1315 1306 1307
f 1314 1306 1315
f 1316 1310 1309
f 1317 1310 1316
f 1311 1318 1309
f 1318 1316 1309
f 1312 1319 1311
f 1319 1318 1311
f 1153 1158 1320
f 1153 1320 1312
f 1312 1320 1319
f 1158 1159 1320
f 1155 1313 1160
f 1161 1160 1313
f 1314 1161 1313
f 1163 1321 1322
f 1161 1321 1163
f 1161 1315 1321
f 1161 1314 1315
f 1321 1323 1322
f 1316 1324 1317
f 1324 1325 1326
f 1324 1316 1325
f 1316 1318 1325
f 1319 1327 1318
f 1327 1325 1318
f 1320 1328 1319
f 1328 1327 1319
f 1159 1164 1329
f 1159 1329 1320
f 1320 1329 1328
f 1164 1165 1329
f 1163 1322 1166
f 1322 1167 1166
f 1322 1323 1167
f 1323 1330 1167
f 1331 1326 1325
f 1332 1326 1331
f 1327 1333 1325
f 1333 1331 1325
f 1328 1334 1327
f 1334 1333 1327
f 1329 1335 1328
f 1335 1334 1328
f 1165 1168 1335
f 1329 1165 1335
f 1167 1330 1336
f 1169 1167 1336
f 1336 1170 1169
f 1337 1170 1336
f 1331 1338 1332
f 1338 1339 1340
f 1338 1331 1339
f 1331 1333 1339
f 1334 1341 1333
f 1341 1339 1333
f 1335 1342 1334
f 1342 1341 1334
f 1168 1171 1343
f 1168 1343 1335
f 1335 1343 1342
f 1171 1173 1343
f 1170 1337 1174
f 1337 1344 1174
f 1345 1340 1339
f 1346 1340 1345
f 1341 1347 1339
f 1347 1345 1339
f 1342 1348 1341
f 1348 1347 1341
f 1343 1349 1342
f 1349 1348 1342
f 1173 1176 1349
f 1343 1173 1349
f 1174 1344 1350
f 1178 1174 1350
f 1350 1179 1178
f 1351 1179 1350
f 1352 1346 1345
f 1353 1346 1352
f 1347 1354 1345
f 1354 1352 1345
f 1348 1355 1347
f 1355 1354 1347
f 1349 1356 1348
f 1356 1355 1348
f 1176 1181 1356
f 1349 1176 1356
f 1179 1351 1183
f 1351 1357 1183
f 1352 1358 1353
f 1358 1359 1360
f 1358 1352 1359
f 1352 1354 1359
f 1355 1361 1354
f 1361 1359 1354
f 1356 1362 1355
f 1362 1361 1355
f 1181 1185 1362
f 1356 1181 1362
f 1183 1357 1363
f 1188 1183 1363
f 1363 1189 1188
f 1364 1189 1363
f 1365 1360 1359
f 1366 1360 1365
f 1361 1367 1359
f 1367 1365 1359
f 1362 1368 1361
f 1368 1367 1361
f 1185 1191 1368
f 1362 1185 1368
f 1189 1364 1369
f 1195 1189 1369
f 1369 1196 1195
f 1370 1196 1369
f 1365 1371 1366
f 1371 1372 1373
f 1371 1365 1372
f 1365 1367 1372
f 1368 1374 1367
f 1374 1372 1367
f 1191 1198 1374
f 1368 1191 1374
f 1196 1370 1375
f 1202 1196 1375
f 1375 1203 1202
f 1376 1203 1375
f 1377 1373 1372
f 1378 1373 1377
f 1374 1379 1372
f 1379 1377 1372
f 1198 1205 1379
f 1374 1198 1379
f 1203 1376 1380
f 1209 1203 1380
f 1210 1209 1381
f 1209 1380 1381
f 1381 1211 1210
f 1382 1211 1381
f 1383 1378 1377
f 1384 1378 1383
f 1379 1385 1377
f 1385 1383 1377
f 1205 1213 1385
f 1379 1205 1385
f 1211 1382 1386
f 1217 1211 1386
f 1386 1218 1217
f 1387 1218 1386
f 1388 1384 1383
f 1389 1384 1388
f 1221 1220 1388
f 1221 1388 1385
f 1385 1388 1383
f 1213 1221 1385
f 1218 1387 1390
f 1225 1218 1390
f 1226 1225 1391
f 1225 1390 1391
f 1391 1227 1226
f 1392 1227 1391
f 1230 1389 1388
f 1230 1229 1389
f 1229 1393 1389
f 1220 1230 1388
f 1227 1392 1394
f 1234 1227 1394
f 1235 1234 1395
f 1234 1394 1395
f 1236 1235 1396
f 1235 1395 1396
f 1393 1229 1236
f 1396 1393 1236
f 1267 1397 1266
f 1267 1268 1398
f 1397 1267 1398
f 1268 1269 1399
f 1398 1268 1399
f 1269 1270 1400
f 1399 1269 1400
f 1270 1271 1400
f 1397 1401 1279
f 1266 1397 1279
f 1398 1402 1397
f 1402 1401 1397
f 1399 1403 1398
f 1403 1402 1398
f 1400 1404 1399
f 1404 1403 1399
f 1271 1280 1405
f 1271 1405 1400
f 1400 1405 1404
f 1280 1281 1406
f 1405 1280 1406
f 1281 1282 1406
f 1401 1407 1289
f 1279 1401 1289
f 1402 1408 1401
f 1408 1407 1401
f 1403 1409 1402
f 1409 1408 1402
f 1404 1410 1403
f 1410 1409 1403
f 1405 1411 1404
f 1411 1410 1404
f 1406 1412 1405
f 1412 1411 1405
f 1282 1290 1413
f 1282 1413 1406
f 1406 1413 1412
f 1290 1291 1414
f 1413 1290 1414
f 1291 1293 1414
f 1407 1415 1298
f 1289 1407 1298
f 1408 1416 1407
f 1416 1415 1407
f 1409 1417 1408
f 1417 1416 1408
f 1410 1418 1409
f 1418 1417 1409
f 1411 1419 1410
f 1419 1418 1410
f 1412 1420 1411
f 1420 1419 1411
f 1413 1421 1412
f 1421 1420 1412
f 1414 1422 1413
f 1422 1421 1413
f 1293 1299 1423
f 1293 1423 1414
f 1414 1423 1422
f 1299 1301 1423
f 1415 1424 1307
f 1298 1415 1307
f 1416 1425 1415
f 1425 1424 1415
f 1417 1426 1416
f 1426 1425 1416
f 1418 1427 1417
f 1427 1426 1417
f 1419 1428 1418
f 1428 1427 1418
f 1420 1429 1419
f 1429 1428 1419
f 1421 1430 1420
f 1430 1429 1420
f 1422 1431 1421
f 1431 1430 1421
f 1423 1432 1422
f 1432 1431 1422
f 1301 1308 1433
f 1301 1433 1423
f 1423 1433 1432
f 1308 1310 1433
f 1424 1434 1315
f 1307 1424 1315
f 1425 1435 1424
f 1435 1434 1424
f 1426 1436 1425
f 1436 1435 1425
f 1427 1437 1426
f 1437 1436 1426
f 1428 1438 1427
f 1438 1437 1427
f 1429 1439 1428
f 1439 1438 1428
f 1430 1440 1429
f 1440 1439 1429
f 1431 1441 1430
f 1441 1440 1430
f 1432 1442 1431
f 1442 1441 1431
f 1433 1443 1432
f 1443 1442 1432
f 1310 1317 1443
f 1433 1310 1443
f 1315 1434 1321
f 1323 1321 1434
f 1323 1434 1444
f 1444 1434 1435
f 1436 1445 1435
f 1445 1444 1435
f 1437 1446 1436
f 1446 1445 1436
f 1438 1447 1437
f 1447 1446 1437
f 1439 1448 1438
f 1448 1447 1438
f 1440 1449 1439
f 1449 1448 1439
f 1441 1450 1440
f 1450 1449 1440
f 1442 1451 1441
f 1451 1450 1441
f 1443 1452 1442
f 1452 1451 1442
f 1317 1324 1453
f 1317 1453 1443
f 1443 1453 1452
f 1324 1326 1453
f 1444 1454 1330
f 1323 1444 1330
f 1445 1455 1444
f 1455 1454 1444
f 1446 1456 1445
f 1456 1455 1445
f 1447 1457 1446
f 1457 1456 1446
f 1448 1458 1447
f 1458 1457 1447
f 1449 1459 1448
f 1459 1458 1448
f 1450 1460 1449
f 1460 1459 1449
f 1451 1461 1450
f 1461 1460 1450
f 1452 1462 1451
f 1462 1461 1451
f 1453 1463 1452
f 1463 1462 1452
f 1326 1332 1463
f 1453 1326 1463
f 1330 1454 1336
f 1337 1336 1454
f 1337 1454 1464
f 1464 1454 1455
f 1456 1465 1455
f 1465 1464 1455
f 1457 1466 1456
f 1466 1465 1456
f 1458 1467 1457
f 1467 1466 1457
f 1459 1468 1458
f 1468 1467 1458
f 1460 1469 1459
f 1469 1468 1459
f 1461 1470 1460
f 1470 1469 1460
f 1462 1471 1461
f 1471 1470 1461
f 1463 1472 1462
f 1472 1471 1462
f 1332 1338 1473
f 1332 1473 1463
f 1463 1473 1472
f 1338 1340 1473
f 1464 1474 1344
f 1337 1464 1344
f 1465 1475 1464
f 1475 1474 1464
f 1466 1476 1465
f 1476 1475 1465
f 1467 1477 1466
f 1477 1476 1466
f 1468 1478 1467
f 1478 1477 1467
f 1469 1479 1468
f 1479 1478 1468
f 1470 1480 1469
f 1480 1479 1469
f 1471 1481 1470
f 1481 1480 1470
f 1472 1482 1471
f 1482 1481 1471
f 1473 1483 1472
f 1483 1482 1472
f 1340 1346 1483
f 1473 1340 1483
f 1344 1474 1350
f 1351 1350 1474
f 1351 1474 1484
f 1484 1474 1475
f 1476 1485 1475
f 1485 1484 1475
f 1477 1486 1476
f 1486 1485 1476
f 1478 1487 1477
f 1487 1486 1477
f 1479 1488 1478
f 1488 1487 1478
f 1480 1489 1479
f 1489 1488 1479
f 1481 1490 1480
f 1490 1489 1480
f 1482 1491 1481
f 1491 1490 1481
f 1483 1492 1482
f 1492 1491 1482
f 1346 1353 1492
f 1483 1346 1492
f 1484 1493 1357
f 1351 1484 1357
f 1485 1494 1484
f 1494 1493 1484
f 1486 1495 1485
f 1495 1494 1485
f 1487 1496 1486
f 1496 1495 1486
f 1488 1497 1487
f 1497 1496 1487
f 1489 1498 1488
f 1498 1497 1488
f 1490 1499 1489
f 1499 1498 1489
f 1491 1500 1490
f 1500 1499 1490
f 1492 1501 1491
f 1501 1500 1491
f 1353 1358 1502
f 1353 1502 1492
f 1492 1502 1501
f 1358 1360 1502
f 1357 1493 1363
f 1364 1363 1493
f 1364 1493 1503
f 1503 1493 1494
f 1495 1504 1494
f 1504 1503 1494
f 1496 1505 1495
f 1505 1504 1495
f 1497 1506 1496
f 1506 1505 1496
f 1498 1507 1497
f 1507 1506 1497
f 1499 1508 1498
f 1508 1507 1498
f 1500 1509 1499
f 1509 1508 1499
f 1501 1510 1500
f 1510 1509 1500
f 1502 1511 1501
f 1511 1510 1501
f 1360 1366 1511
f 1502 1360 1511
f 1364 1503 1369
f 1370 1369 1503
f 1370 1503 1512
f 1512 1503 1504
f 1505 1513 1504
f 1513 1512 1504
f 1506 1514 1505
f 1514 1513 1505
f 1507 1515 1506
f 1515 1514 1506
f 1508 1516 1507
f 1516 1515 1507
f 1509 1517 1508
f 1517 1516 1508
f 1510 1518 1509
f 1518 1517 1509
f 1511 1519 1510
f 1519 1518 1510
f 1366 1371 1520
f 1366 1520 1511
f 1511 1520 1519
f 1371 1373 1520
f 1370 1512 1375
f 1376 1375 1512
f 1376 1512 1521
f 1521 1512 1513
f 1514 1522 1513
f 1522 1521 1513
f 1515 1523 1514
f 1523 1522 1514
f 1516 1524 1515
f 1524 1523 1515
f 1517 1525 1516
f 1525 1524 1516
f 1518 1526 1517
f 1526 1525 1517
f 1519 1527 1518
f 1527 1526 1518
f 1520 1528 1519
f 1528 1527 1519
f 1373 1378 1528
f 1520 1373 1528
f 1376 1521 1380
f 1381 1380 1521
f 1522 1381 1521
f 1382 1381 1522
f 1382 1522 1529
f 1529 1522 1523
f 1524 1530 1523
f 1530 1529 1523
f 1525 1531 1524
f 1531 1530 1524
f 1526 1532 1525
f 1532 1531 1525
f 1527 1533 1526
f 1533 1532 1526
f 1528 1534 1527
f 1534 1533 1527
f 1378 1384 1534
f 1528 1378 1534
f 1382 1529 1386
f 1387 1386 1529
f 1387 1529 1535
f 1535 1529 1530
f 1531 1536 1530
f 1536 1535 1530
f 1532 1537 1531
f 1537 1536 1531
f 1533 1538 1532
f 1538 1537 1532
f 1534 1539 1533
f 1539 1538 1533
f 1384 1389 1539
f 1534 1384 1539
f 1387 1535 1390
f 1391 1390 1535
f 1536 1391 1535
f 1392 1391 1536
f 1392 1536 1540
f 1540 1536 1537
f 1538 1541 1537
f 1541 1540 1537
f 1539 1542 1538
f 1542 1541 1538
f 1389 1393 1542
f 1539 1389 1542
f 1392 1540 1394
f 1395 1394 1540
f 1541 1395 1540
f 1396 1395 1541
f 1542 1396 1541
f 1393 1396 1542
